{"text_format":"1","workbook":"xlsx","n_sheets":3,"sheets":[" Neptolux SWE","Neptolux FIN","Neptolux ENG"],"not_rendered":{"charts":11,"images":0,"macros":1,"external_links":0,"defined_names":0,"comments":0,"pivot_tables":0},"unopened":[],"bounds":{"document_bytes":16777216,"sheet_cells":100000,"rows_first":2000,"rows_last":500,"rows_between":2000,"halvings":0,"cell_chars":16384,"cell_head_chars":4096},"cells_cut":0,"cells_raw":0,"read":"whole","date_system":"1900"}

{"sheet":" Neptolux SWE","index":0,"n_rows":344,"n_cols":57,"rows_kept":344,"cut":false,"hidden":false,"merged":[[36,9,37,16],[30,9,31,16],[6,9,6,11],[7,9,7,11],[14,4,14,5],[14,6,14,7],[26,9,27,16],[28,9,29,16],[5,9,5,11],[0,9,0,11],[1,9,1,11],[2,9,2,11],[3,9,3,11],[4,9,4,11]]}
["Kabeldimensionering och belastning",null,null,null,null,null,null,null,"Projekt:"]
[{"$f":"'Neptolux FIN'!A2","v":"v 1.1"}]
["Nepto 3K",null,null,null,null,null,null,null,"Datum:"]
[null,"Lepo",null,null,"Antal","Konsumtion, mA"]
["Nepto 3K",60,null,null,1,{"$f":"E5*B5","v":60},null,null,"Version:"]
["Linjekort (linje 2)",15,null,null,0,{"$f":"E6*B6","v":0}]
["Nätverk kort (HedRing.net)",40,null,null,0,0,null,null,"Nummer:"]
["NL-KLG",60,null,null,0,0]
[]
["Totalt:",null,null,null,null,{"$f":"SUM(F5:F9)","v":60}]
[]
[]
[null,null,null,null,null,null,null,null,null,null,null,null,null,null,null,null,null,null,"Maxbelastning kalkyl"]
[]
["Nödbelysning","Lepo","Lataus/vikaledi",null,"Linje 1",null,"Linje 2",null,null,"Manuell",null,null,null,null,null,null,null,null,"Neptolux- utrustning",null,null,null,"Linje 1",null,null,null,"Linje 2"]
[null,null,"päällä",null,"Antal","Ström, mA","Antal","Ström, mA",null,null,null,null,null,null,null,null,null,null,null,"I, [mA]","NU","P, [W]","Antal","NU","Kraft, W","Ström, mA","Antal","NU","Kraft, W","Ström, mA"]
["N68-C/ N68-O (0) FABRIKSINSTÄLLNING",7.8,0.4,null,0,{"$f":"(B17*E17)","v":0},0,{"$f":"(B17*G17)","v":0},null,"Med denna räknare bestäms:",null,null,null,null,null,null,null,null,"N68-C/N68-O 24h, Normal kraft",{"$f":"B17","v":7.8},4.8,0.04,{"$f":"(E17-W18-W19-W20)","v":0},{"$f":"(W17*U17)","v":0},{"$f":"(W17*0.25)","v":0},{"$f":"(W17*T17)","v":0},{"$f":"(G17-AA18-AA19-AA20)","v":0},{"$f":"(AA17*Y17)","v":0},{"$f":"(AA17*0.25)","v":0},{"$f":"(AA17*T17)","v":0}]
["N68-C/ N68-O (1)",11.04,0.4,null,0,{"$f":"(B18*E18)","v":0},0,0,null,"Nepto 3K- centralen energiförbrukning",null,null,null,null,null,null,null,null,"N68-C/N68-O 12h, Normal kraft",{"$f":"(T17+4.7)","v":12.5},{"$f":"(U17+2)","v":6.8},0.96,0,{"$f":"(W18*U18)","v":0},0,0,0,{"$f":"(AA18*Y18)","v":0},0,{"$f":"(AA18*T18)","v":0}]
["N68-C/ N68-O (2)",14.280000000000001,0.4,null,0,0,0,0,null,"Linje belastning",null,null,null,null,null,null,null,null,"N68-C/N68-O 24h, Hi-Power",{"$f":"(T17+4.7)","v":12.5},{"$f":"(U17+2)","v":6.8},0.04,0,0,{"$f":"(W19*0.25)","v":0},0,0,0,{"$f":"(AA19*0.25)","v":0},{"$f":"(AA19*T19)","v":0}]
["N68-C/ N68-O (3)",17.52,0.4,null,0,0,0,0,null,"Linje maxlängd",null,null,null,null,null,null,null,null,"N68-C/N68-O 12h, Hi-Power",{"$f":"(T17+21.7)","v":29.5},{"$f":"(U17+13)","v":17.8},0.96,0,0,{"$f":"(W20*0.25)","v":0},0,0,0,{"$f":"(AA20*0.25)","v":0},0]
["N68-C/ N68-O (4)",24,0.4,null,0,0,0,0,null,"Central batteri dimensionering",null,null,null,null,null,null,null,null,"N20 24h, Normal kraft",{"$f":"B29","v":12.7},7.9,0.25,{"$f":"(E29-W22)","v":0},0,{"$f":"(W21*0.25)","v":0},0,{"$f":"(G29-AA22)","v":0},0,{"$f":"(AA21*0.25)","v":0},0]
["N68-C/ N68-O (5)",30.48,0.4,null,0,0,0,0,null,null,null,null,null,null,null,null,null,null,"N20 12h, Normal kraft",{"$f":"(T21+4.7)","v":17.399999999999999},{"$f":"(U21+2)","v":9.9},0.25,0,0,{"$f":"(W22*0.25)","v":0},0,0,0,{"$f":"(AA22*0.25)","v":0},0]
["N68-C/ N68-O (6)",36.311999999999998,0.4,null,0,0,0,0,null,"1. Insätt mängden centraler",null,null,null,null,null,null,null,null,"N40 24h, Normal kraft",{"$f":"B37","v":20.399999999999999},12.6,0.53,{"$f":"(E37-W24)","v":0},0,{"$f":"(W23*0.53)","v":0},0,{"$f":"(G37-AA24)","v":0},0,{"$f":"(AA23*0.53)","v":0},0]
["N68-C/ N68-O (7) AKTIVT LÄGE",36.311999999999998,0.4,null,0,0,0,0,null,"2. Insätt armaturtyperna för varje linje. Standardljusstyrkan är märkt med bold",null,null,null,null,null,null,null,null,"N40 12h, Normal kraft",{"$f":"(T23+4.7)","v":25.099999999999998},{"$f":"(U23+2)","v":14.6},0.53,0,0,{"$f":"(W24*0.53)","v":0},0,0,0,{"$f":"(AA24*0.53)","v":0},0]
["N20 / N20-X (0)",6.1,0.4,null,0,0,0,0,null,"3. Tabellen meddelar ifall maxbelastning eller maxmängd överskrids",null,null,null,null,null,null,null,null,"N68-C-3/N68-O-3 24h, Normal kraft",{"$f":"B41","v":22},13.6,0.04,{"$f":"(E41-W26-W27-W28)","v":0},0,{"$f":"(W25*0.25)","v":0},0,{"$f":"(G41-AA26-AA27-AA28)","v":0},0,{"$f":"(AA25*0.25)","v":0},0]
["N20 / N20-X (1)",7.333333333333333,0.4,null,0,0,0,0,null,"4. Mata in linjens beräknade maxlängd på rad 148 (distansen från centralen till den bortersta armaturen)",null,null,null,null,null,null,null,null,"N68-C-3/N68-O-3 12h, Normal kraft",{"$f":"(T25+17.1)","v":39.1},{"$f":"(U25+11)","v":24.6},0.96,0,0,0,0,0,0,0,0]
["N20 / N20-X (2)",8.5666666666666664,0.4,null,0,0,0,0,null,"5. Tabellen använder det i paragraf 2 insatta värden och meddelar för varje kabeltyp, ifall belastningen är inom lämpliga värden ",null,null,null,null,null,null,null,null,"N68-C-3/N68-O-3 24h, Hi-Power",{"$f":"(T25+4.7)","v":26.7},{"$f":"(U25+11)","v":24.6},0.04,0,0,0,0,0,0,0,0]
["N20 / N20-X (3)",9.8000000000000007,0.4,null,0,0,0,0,null,null,null,null,null,null,null,null,null,null,"N68-C-3/N68-O-3 12h, Hi-Power",{"$f":"(T25+24.1)","v":46.1},{"$f":"(U25+15)","v":28.6},0.96,0,0,0,0,0,0,0,0]
["N20 / N20-X (4) FABRIKSINSTÄLLNING",12.7,0.4,null,0,0,0,0,null,"6. Det är möjligt att använda sig av inställning för Hi-Power eller 12h laddning, som ökar linjens maxbelastning under laddning.",null,null,null,null,null,null,null,null,"N20-3 24h, Normal kraft",{"$f":"B53","v":20.406666666666666},12.8,0.25,{"$f":"(E53-W30)","v":0},0,0,{"$f":"(W29*T29)","v":0},{"$f":"(G53-AA30)","v":0},0,0,0]
["N20 / N20-X (5)",15.350000000000001,0.4,null,0,0,0,0,null,null,null,null,null,null,null,null,null,null,"N20-3 12h, Normal kraft",{"$f":"(T29+17.1)","v":37.506666666666668},{"$f":"(U29+11)","v":23.8},0.25,0,0,0,{"$f":"(W30*T30)","v":0},0,0,0,0]
["N20 / N20-X (6)",18.100000000000001,0.4,null,0,0,0,0,null,"Använd vid behov hjälptabellen till höger för att definiera maxbelastningen under laddning. Tabellen använder de matade värdena och tar dem i beaktande för att definiera kabeltyp (de aktiva rutorna har en mörkare färg). ",null,null,null,null,null,null,null,null,"N40-3 24h, Normal kraft",{"$f":"B61","v":28.106666666666662},19.3,0.53,{"$f":"(E61-W32)","v":0},0,0,0,{"$f":"(G53-AA32)","v":0},0,0,0]
["N20 / N20-X (7)",12.7,0.4,null,0,0,0,0,null,null,null,null,null,null,null,null,null,null,"N40-3 12h, Normal kraft",{"$f":"(T31+17.1)","v":45.206666666666663},{"$f":"(U31+11)","v":30.3},0.53,0,0,0,{"$f":"(W32*T32)","v":0},0,0,0,0]
["N40 / N40-X (0)",6.1,0.4,null,0,0,0,0,null,null,null,null,null,null,null,null,null,null,"N55 24h, Normal kraft",{"$f":"B81","v":6.1},3.8,0.04,{"$f":"(E81-W34-W35-W36)","v":0},0,0,0,{"$f":"(G81-AA34-AA35-AA36)","v":0},0,0,0]
["N40 / N40-X (1)",8.3879999999999999,0.4,null,0,0,0,0,null,null,null,null,null,null,null,null,null,null,"N55 12h, Normal kraft",9.6999999999999993,{"$f":"(U33+2)","v":5.8},0.96,0,0,0,{"$f":"(W34*T34)","v":0},0,0,0,0]
["N40 / N40-X (2)",11.82,0.4,null,0,0,0,0,null,"Central batteri",null,null,null,null,null,null,null,null,"N55 24h, Hi-Power",13.8,{"$f":"(U33+2)","v":5.8},0.04,0,0,0,{"$f":"(W35*T35)","v":0},0,0,0,0]
["N40 / N40-X (3)",15.251999999999999,0.4,null,0,0,0,0,null,"1. Då man definierar belastningen för kabeln, bör armaturernas värden för aktivt läge användas",null,null,null,null,null,null,null,null,"N55 12h, Hi-Power",32,{"$f":"(U33+13)","v":16.8},0.96,0,0,0,{"$f":"(W36*T36)","v":0},0,0,0,0]
["N40 / N40-X (4) FABRIKSINSTÄLLNING",20.399999999999999,0.4,null,0,0,0,0,null,"2. Märk mängden av linjens säkerhetsljus- och hänvisningsarmaturer på raden ”AKTIVT LÄGE”. På raden ”FABRIKSINSTÄLLNING” sätts mängden hänvisningsarmaturer.",null,null,null,null,null,null,null,null,"N55-3 24h, Normal kraft",{"$f":"B89","v":9.6999999999999993},6,0.04,{"$f":"(E89-W38-W39-W40)","v":0},0,0,0,{"$f":"(G89-AA38-AA39-AA40)","v":0},0,0,0]
["N40 / N40-X (5)",23.259999999999998,0.4,null,0,0,0,0,null,null,null,null,null,null,null,null,null,null,"N55-3 12h, Normal kraft",28.3,{"$f":"(U37+11)","v":17},0.96,0,0,0,{"$f":"(W38*T38)","v":0},0,0,0,0]
["N40 / N40-X (6)",26.119999999999997,0.4,null,0,0,0,0,null,"3. Då man använder sig av ett centralbatterisystem, bör tillräcklig drifttid för batterierna definieras",null,null,null,null,null,null,null,null,"N55-3 24h, Hi-Power",13.8,{"$f":"(U37+11)","v":17},0.04,0,0,0,{"$f":"(W39*T39)","v":0},0,0,0,0]
["N40 / N40-X (7)",20.399999999999999,0.4,null,0,0,0,0,null,"4. Mata in önskad ”drifttid” samt ”använd batteristorlek” i kalkylatorn",null,null,null,null,null,null,null,null,"N55-3 12h, Hi-Power",32,{"$f":"(U37+15)","v":21},0.96,0,0,0,{"$f":"(W40*T40)","v":0},0,0,0,0]
["N68-C3/ N68-O3 (0) FABRIKSINSTÄLLNING",22,0.4,null,0,0,0,0,null,"5. Kalkylatorn meddelar ifall tillräcklig batteristorlek är vald",null,null,null,null,null,null,null,null,"N89-C/N89-O 24h, Normal kraft",{"$f":"B97","v":16.5},10.199999999999999,0.08,{"$f":"(E97-W42)","v":0},0,0,0,{"$f":"(G97-AA42)","v":0},0,0,0]
["N68-C3/ N68-O3 (1)",25.24,0.4,null,0,0,0,0,null,null,null,null,null,null,null,null,null,null,"N89-C/N89-O 12h, Normal kraft",{"$f":"(T41+11)","v":27.5},{"$f":"(U41+6.5)","v":16.7},6.82,0,0,0,{"$f":"(W42*T42)","v":0},0,0,0,0]
["N68-C3/ N68-O3 (2)",28.48,0.4,null,0,0,0,0,null,null,null,null,null,null,null,null,null,null,"N89-C-3/N89-O-3 24h, Normal kraft",44.5,27.6,0.08,{"$f":"(E105-W44)","v":0},0,0,0,{"$f":"(G105-AA44)","v":0},0,0,0]
["N68-C3/ N68-O3 (3)",31.72,0.4,null,0,0,0,0,null,null,null,null,null,null,null,null,null,null,"N89-C-3/N89-O-3 12h, Normal kraft",{"$f":"(T43+36)","v":80.5},{"$f":"(U43+22.5)","v":50.1},6.82,0,0,0,{"$f":"(W44*T44)","v":0},0,0,0,0]
["N68-C3/ N68-O3 (4)",38.200000000000003,0.4,null,0,0,0,0,null,null,null,null,null,null,null,null,null,null,"N40C 24h, Normal kraft",{"$f":"B117","v":50.5},31.3,0.08,{"$f":"(E117-W46)","v":0},0,0,0,{"$f":"(G117-AA46)","v":0},0,0,0]
["N68-C3/ N68-O3 (5)",44.68,0.4,null,0,0,0,0,null,null,null,null,null,null,null,null,null,null,"N40C 12h, Normal kraft",{"$f":"(T45+11)","v":61.5},{"$f":"(U45+6.5)","v":37.799999999999997},6.82,0,0,0,{"$f":"(W46*T46)","v":0},0,0,0,0]
["N68-C3/ N68-O3 (6)",50.512,0.4,null,0,0,0,0,null,null,null,null,null,null,null,null,null,null,"N40C-3 24h, Normal kraft",78.5,{"$f":"(31.3+6.8)","v":38.1},0.08,{"$f":"(E125-W48)","v":0},0,0,0,{"$f":"(G125-AA48)","v":0},0,0,0]
["N68-C3/ N68-O3 (7) AKTIVT LÄGE",50.512,0.4,null,0,0,0,0,null,null,null,null,null,null,null,null,null,null,"N40C-3 12h, Normal kraft",{"$f":"(78.5+36)","v":114.5},{"$f":"(48.7+22.5)","v":71.2},6.82,0,0,0,0,0,0,0,0]
["N20-3 / N20-X3 (0)",13.806666666666665,0.4,null,0,0,0,0,null,null,null,null,null,null,null,null,null,null,"N70 24h, Normal kraft",{"$f":"B69","v":50.5},31.3,0.08,{"$f":"(E69-W50)","v":0},0,0,{"$f":"(W49*T49)","v":0},{"$f":"(G69-AA50)","v":0},0,0,0]
["N20-3 / N20-X3 (1)",15.04,0.4,null,0,0,0,0,null,null,null,null,null,null,null,null,null,null,"N70 12h, Normal kraft",{"$f":"(50.5+11)","v":61.5},{"$f":"(31.3+6.8)","v":38.1},0.92,0,0,0,{"$f":"(W50*T50)","v":0},0,0,0,0]
["N20-3 / N20-X3 (2)",16.273333333333333,0.4,null,0,0,0,0,null,null,null,null,null,null,null,null,null,null,"N70-3 24h, Normal kraft",{"$f":"B77","v":78.5},48.7,0.08,{"$f":"(E77-W52)","v":0},0,0,{"$f":"(W51*T51)","v":0},{"$f":"(G77-AA52)","v":0},0,0,0]
["N20-3 / N20-X3 (3)",17.506666666666668,0.4,null,0,0,0,0,null,null,null,null,null,null,null,null,null,null,"N70-3 12h, Normal kraft",{"$f":"(78.5+36)","v":114.5},{"$f":"(48.7+22.5)","v":71.2},0.92,0,0,0,{"$f":"(W52*T52)","v":0},0,0,0,0]
["N20-3 / N20-X3 (4) FABRIKSINSTÄLLNING",20.406666666666666,0.4,null,0,0,0,0,null,null,null,null,null,null,null,null,null,null,"N-IO",{"$f":"B129","v":3.2},2,0.1,{"$f":"(W5)","v":0},0,0,0,{"$f":"(AA5)","v":0},0,0,{"$f":"(AA53*T53)","v":0}]
["N20-3 / N20-X3 (5)",23.056666666666665,0.4,null,0,0,0,0,null,null,null,null,null,null,null,null,null,null,null,null,null,null,"Max. 127",null,null,"Max. 2000","Max. 127",null,null,"Max. 2000"]
["N20-3 / N20-X3 (6)",25.806666666666665,0.4,null,0,0,0,0,null,null,null,null,null,null,null,null,null,null,"Totalt:",null,null,null,{"$f":"SUM(W17:W53)","v":0},{"$f":"SUM(X17:X53)","v":0},{"$f":"SUM(Y17:Y53)","v":0},{"$f":"SUM(Z17:Z54)","v":0},{"$f":"SUM(AA17:AA53)","v":0},{"$f":"SUM(AB17:AB53)","v":0},{"$f":"SUM(AC17:AC53)","v":0},{"$f":"SUM(AD17:AD53)","v":0}]
["N20-3 / N20-X3 (7)",20.406666666666666,0.4,null,0,0,0,0,null,null,null,null,null,null,null,null,null,null,null,null,null,null,{"$f":"(W55/127)","v":0},null,null,{"$f":"(Z55/2000)","v":0},{"$f":"(AA55/127)","v":0},null,null,{"$f":"(AD55/2000)","v":0}]
["N40-3 / N40-X3 (0)",13.806666666666665,0.4,null,0,0,0,0]
["N40-3 / N40-X3 (1)",16.094666666666665,0.4,null,0,0,0,0]
["N40-3 / N40-X3 (2)",19.526666666666664,0.4,null,0,0,0,0]
["N40-3 / N40-X3 (3)",22.958666666666666,0.4,null,0,0,0,0]
["N40-3 / N40-X3 (4) FABRIKSINSTÄLLNING",28.106666666666662,0.4,null,0,0,0,0]
["N40-3 / N40-X3 (5)",30.966666666666661,0.4,null,0,0,0,0]
["N40-3 / N40-X3 (6)",33.826666666666661,0.4,null,0,0,0,0]
["N40-3 / N40-X3 (7)",28.106666666666662,0.4,null,0,0,0,0]
["N70 / N70-X (0)",16.5,0.4,null,0,0,0,0]
["N70 / N70-X (1)",23.3,0.4,null,0,0,0,0]
["N70 / N70-X (2)",30.1,0.4,null,0,0,0,0]
["N70 / N70-X (3)",36.9,0.4,null,0,0,0,0]
["N70 / N70-X (4) FABRIKSINSTÄLLNING",50.5,0.4,null,0,0,0,0]
["N70 / N70-X (5)",57.3,0.4,null,0,0,0,0]
["N70 / N70-X (6)",70.900000000000006,0.4,null,0,0,0,0]
["N70 / N70-X (7)",43.7,0.4,null,0,0,0,0]
["N70-3 / N70-X-3 (0)",44.5,0.4,null,0,0,0,0]
["N70-3 / N70-X-3 (1)",51.3,0.4,null,0,0,0,0]
["N70-3 / N70-X-3 (2)",58.1,0.4,null,0,0,0,0]
["N70-3 / N70-X-3 (3)",64.900000000000006,0.4,null,0,0,0,0]
["N70-3 / N70-X-3 (4) FABRIKSINSTÄLLNING",78.5,0.4,null,0,0,0,0]
["N70-3 / N70-X-3 (5)",85.3,0.4,null,0,0,0,0]
["N70-3 / N70-X-3 (6)",98.9,0.4,null,0,0,0,0]
["N70-3 / N70-X-3 (7)",71.7,0.4,null,0,0,0,0]
["N55 (0) FABRIKSINSTÄLLNING",6.1,0.4,null,0,0,0,{"$f":"(B81*G81)","v":0}]
["N55 (1)",9.5,0.4,null,0,0,0,0]
["N55 (2)",12.9,0.4,null,0,0,0,0]
["N55 (3)",16.2,0.4,null,0,0,0,0]
["N55 (4)",23,0.4,null,0,0,0,0]
["N55 (5)",29.8,0.4,null,0,0,0,0]
["N55 (6)",35.799999999999997,0.4,null,0,0,0,0]
["N55 (7) AKTIVT LÄGE",35.799999999999997,0.4,null,0,0,0,0]
["N55-3 (0) FABRIKSINSTÄLLNING",9.6999999999999993,0.4,null,0,0,0,0]
["N55-3 (1)",13.1,0.4,null,0,0,0,0]
["N55-3 (2)",16.5,0.4,null,0,0,0,0]
["N55-3 (3)",19.8,0.4,null,0,0,0,0]
["N55-3 (4)",26.6,0.4,null,0,0,0,0]
["N55-3 (5)",33.4,0.4,null,0,0,0,0]
["N55-3 (6)",39.5,0.4,null,0,0,0,0]
["N55-3 (7) AKTIVT LÄGE",39.5,0.4,null,0,0,0,0]
["N89-C/N89-O (0) FABRIKSINSTÄLLNING",16.5,0.4,null,0,0,0,0]
["N89-C/N89-O (1)",30.1,0.4,null,0,{"$f":"(B98*E98)","v":0},0,0]
["N89-C/N89-O (2)",36.9,0.4,null,0,0,0,0]
["N89-C/N89-O (3)",43.7,0.4,null,0,0,0,0]
["N89-C/N89-O (4)",50.5,0.4,null,0,0,0,0]
["N89-C/N89-O (5)",64.099999999999994,0.4,null,0,0,0,0]
["N89-C/N89-O (6) AKTIVT LÄGE",152.5,0.4,null,0,0,0,0]
["N89-C/N89-O (7)",234.1,0.4,null,0,0,0,0]
["N89-C3/N89-O3 (0) FABRIKSINSTÄLLNING",44.5,0.4,null,0,0,0,0]
["N89-C3/N89-O3 (1)",58.1,0.4,null,0,0,0,0]
["N89-C3/N89-O3 (2)",64.900000000000006,0.4,null,0,0,0,0]
["N89-C3/N89-O3 (3)",71.7,0.4,null,0,0,0,0]
["N89-C3/N89-O3 (4)",78.5,0.4,null,0,0,0,0]
["N89-C3/N89-O3 (5)",92.1,0.4,null,0,0,0,0]
["N89-C3/N89-O3 (6) AKTIVT LÄGE",180.5,0.4,null,0,0,0,0]
["N89-C3/N89-O3 (7)",262.10000000000002,0.4,null,0,0,0,0]
["N40C/N40C (0)",16.5,0.4,null,0,0,0,0]
["N40C/N40C (1)",30.1,0.4,null,0,0,0,0]
["N40C/N40C (2)",36.9,0.4,null,0,0,0,0]
["N40C/N40C (3)",43.7,0.4,null,0,0,0,0]
["N40C/N40C (4) FABRIKSINSTÄLLNING",50.5,0.4,null,0,0,0,0]
["N40C/N40C (5)",64.099999999999994,0.4,null,0,0,0,0]
["N40C/N40C (6)",70.900000000000006,0.4,null,0,0,0,0]
["N40C/N40C (7) AKTIVT LÄGE",234.1,0.4,null,0,0,0,0]
["N40C-3/N40C-3 (0)",44.5,0.4,null,0,0,0,0]
["N40C-3/N40C-3 (1)",58.1,0.4,null,0,0,0,0]
["N40C-3/N40C-3 (2)",64.900000000000006,0.4,null,0,0,0,0]
["N40C-3/N40C-3 (3)",71.7,0.4,null,0,0,0,0]
["N40C-3/N40C-3 (4) FABRIKSINSTÄLLNING",78.5,0.4,null,0,0,0,0]
["N40C-3/N40C-3 (5)",92.1,0.4,null,0,0,0,0]
["N40C-3/N40C-3 (6)",98.9,0.4,null,0,0,0,0]
["N40C-3/N40C-3 (7) AKTIVT LÄGE",262.10000000000002,0.4,null,0,0,0,0]
["N-IO",3.2,null,null,0,0,0,0]
[]
[null,null,null,null,"Antal","Antal","Antal","Antal"]
["Totalt:",null,null,null,{"$f":"SUM(E17:E129)","v":0},{"$f":"SUM(F17:F129)","v":0},{"$f":"SUM(G17:G129)","v":0},{"$f":"SUM(H17:H129)","v":0}]
[null,null,null,null,{"$f":"IF(E132<128,\"Ok\",\"Fel\")","v":"Ok"},{"$f":"IF(F132<2000,\"Ok\",\"Fel\")","v":"Ok"},{"$f":"IF(G132<128,\"Ok\",\"Fel\")","v":"Ok"},{"$f":"IF(H132<2000,\"Ok\",\"Fel\")","v":"Ok"},null,"Central batteri dimensioning"]
[null,null,null,null,null,null,null,null,null,"Önskad batteristorlek",null,null,{"$f":"((F143*M136*2)/1000)","v":0.12},"Ah"]
["Konsumtion",null,null,null,"Antal","Ström",null,"Maxbelastning"]
[null,null,null,null,"kpl","(mA)",null,"Avgift (mA)",null,"Standbytid",null,null,1,"timmar"]
["Central:",null,null,null,null,{"$f":"F10","v":60}]
["Linje 1",null,null,null,{"$f":"E132","v":0},{"$f":"(F132)","v":0},null,{"$f":"(Z55)","v":0}]
["Linje 2",null,null,null,{"$f":"G132","v":0},{"$f":"H132","v":0},null,{"$f":"(AD55)","v":0},null,"Valt batteristorlek",null,{"$f":"IF(M139>M134,\"OK\",\"Ei voida ladata\")","v":"OK"},14,"Ah"]
[]
[null,null,null,null,null,null,null,null,null,"Faktisk besökstid",null,null,{"$f":"(M139*1000)/(F143*2)","v":116.66666666666667},"h"]
[null,null,null,null,"kpl","(mA)"]
["Yhteensä:",null,null,null,{"$f":"SUM(E138:E142)","v":0},{"$f":"SUM(F137:F142)","v":60}]
[]
[]
[]
[null,null,null,null,"Linje 1","Linje 2"]
["Linje längd [m] (max. 1000m)",null,null,null,1,1]
[null,null,null,null,{"$f":"IF(E148<=1000,\"OK\",\"TOO LONG\")","v":"OK"},{"$f":"IF(F148<=1000,\"OK\",\"TOO LONG\")","v":"OK"}]
["Max ström [mA]",null,null,null,{"$f":"IF(F138<H138,H138,F138)","v":0},{"$f":"IF(F139<H139,H139,F139)","v":0}]
[null,null,0.7,"yF"]
[null,null,0.7,"mH"]
[]
[]
["Osoitteet silmukassa tasavälein"]
["KLMA 2x0.8 74 ohm / km",null,null,null,{"$f":"IF(LOOKUP(E148,#REF!,#REF!)>E150,\"OK\",\"EI OK\")","v":{"$error":"#REF!"}},{"$f":"IF(LOOKUP(F148,#REF!,#REF!)>F150,\"OK\",\"EI OK\")","v":{"$error":"#REF!"}},{"$f":"IF(LOOKUP(G148,#REF!,#REF!)>G150,\"OK\",\"EI OK\")","v":{"$error":"#REF!"}},{"$f":"IF(LOOKUP(H148,#REF!,#REF!)>H150,\"OK\",\"EI OK\")","v":{"$error":"#REF!"}}]
["KLMA 4x0.8 37 ohm / km",null,null,null,{"$f":"IF(LOOKUP(E148,#REF!,#REF!)>E150,\"OK\",\"EI OK\")","v":{"$error":"#REF!"}},{"$f":"IF(LOOKUP(F148,#REF!,#REF!)>F150,\"OK\",\"EI OK\")","v":{"$error":"#REF!"}},{"$f":"IF(LOOKUP(G148,#REF!,#REF!)>G150,\"OK\",\"EI OK\")","v":{"$error":"#REF!"}},{"$f":"IF(LOOKUP(H148,#REF!,#REF!)>H150,\"OK\",\"EI OK\")","v":{"$error":"#REF!"}}]
["KLMA 2kpl 4x0.8 18,5 ohm / km",null,null,null,{"$f":"IF(LOOKUP(E148,#REF!,#REF!)>E150,\"OK\",\"EI OK\")","v":{"$error":"#REF!"}},{"$f":"IF(LOOKUP(F148,#REF!,#REF!)>F150,\"OK\",\"EI OK\")","v":{"$error":"#REF!"}},{"$f":"IF(LOOKUP(G148,#REF!,#REF!)>G150,\"OK\",\"EI OK\")","v":{"$error":"#REF!"}},{"$f":"IF(LOOKUP(H148,#REF!,#REF!)>H150,\"OK\",\"EI OK\")","v":{"$error":"#REF!"}}]
[]
["Addressen I linjen med lika intervall"]
["KLMA 2x0.8 74 ohm / km",null,null,null,{"$f":"IF(AM225>=25,\"OK\",\"TOO LONG\")","v":{"$error":"#DIV/0!"}},{"$f":"IF(BE225>=25,\"OK\",\"TOO LONG\")","v":{"$error":"#DIV/0!"}}]
["KLMA 4x0.8 37 ohm / km",null,null,null,{"$f":"IF(AM263>=25,\"OK\",\"TOO LONG\")","v":{"$error":"#DIV/0!"}},{"$f":"IF(BE263>=25,\"OK\",\"TOO LONG\")","v":{"$error":"#DIV/0!"}}]
["ELQYB 2x1,0 50 ohm / km",null,null,null,{"$f":"IF(AM301>=25,\"OK\",\"TOO LONG\")","v":{"$error":"#DIV/0!"}},{"$f":"IF(BE301>=25,\"OK\",\"TOO LONG\")","v":{"$error":"#DIV/0!"}}]
["ELQYB 4x1,0 25 ohm / km",null,null,null,{"$f":"IF(AM339>=25,\"OK\",\"TOO LONG\")","v":{"$error":"#DIV/0!"}},{"$f":"IF(BE339>=25,\"OK\",\"TOO LONG\")","v":{"$error":"#DIV/0!"}}]
["KLM 2x1,0 50 ohm / km",null,null,null,{"$f":"IF(AM301>=25,\"OK\",\"TOO LONG\")","v":{"$error":"#DIV/0!"}},{"$f":"IF(BE301>=25,\"OK\",\"TOO LONG\")","v":{"$error":"#DIV/0!"}}]
["KLM 4x1,0 25 ohm / km",null,null,null,{"$f":"IF(AM339>=25,\"OK\",\"TOO LONG\")","v":{"$error":"#DIV/0!"}},{"$f":"IF(BE339>=25,\"OK\",\"TOO LONG\")","v":{"$error":"#DIV/0!"}}]
["Osoitteet silmukan päässä",null,null,null,{"$f":"IF(AM342>=25,\"OK\",\"TOO LONG\")","v":"TOO LONG"},{"$f":"IF(BE342>=25,\"OK\",\"TOO LONG\")","v":"TOO LONG"}]
["KLMA 2x0.8 74 ohm / km",null,null,null,"TOO LONG","TOO LONG",{"$f":"IF(LOOKUP(G148,#REF!,#REF!)>G150,\"OK\",\"EI OK\")","v":{"$error":"#REF!"}},{"$f":"IF(LOOKUP(H148,#REF!,#REF!)>H150,\"OK\",\"EI OK\")","v":{"$error":"#REF!"}}]
["KLMA 4x0.8 37 ohm / km",null,null,null,"TOO LONG","TOO LONG",{"$f":"IF(LOOKUP(G148,#REF!,#REF!)>G150,\"OK\",\"EI OK\")","v":{"$error":"#REF!"}},{"$f":"IF(LOOKUP(H148,#REF!,#REF!)>H150,\"OK\",\"EI OK\")","v":{"$error":"#REF!"}}]
["KLMA 2kpl 4x0.8 18,5 ohm / km",null,null,null,"TOO LONG","TOO LONG",{"$f":"IF(LOOKUP(G148,#REF!,#REF!)>G150,\"OK\",\"EI OK\")","v":{"$error":"#REF!"}},{"$f":"IF(LOOKUP(H148,#REF!,#REF!)>H150,\"OK\",\"EI OK\")","v":{"$error":"#REF!"}}]
[]
["Osoitteet linjan päässä"]
["KLMA 2x0.8 74 ohm / km",null,null,null,{"$f":"IF(G227<=15,\"OK\",\"TOO LONG\")","v":"OK"},{"$f":"IF(H227<=15,\"OK\",\"TOO LONG\")","v":"OK"}]
["KLMA 4x0.8 37 ohm / km",null,null,null,{"$f":"IF(G228<=15,\"OK\",\"TOO LONG\")","v":"OK"},"OK"]
["ELQYB 2x1,0 50 ohm / km",null,null,null,"OK","OK"]
["ELQYB 4x1,0 25 ohm / km",null,null,null,"OK","OK"]
["KLM 2x1,0 50 ohm / km",null,null,null,{"$f":"IF(G229<=15,\"OK\",\"TOO LONG\")","v":"OK"},{"$f":"IF(H229<=15,\"OK\",\"TOO LONG\")","v":"OK"}]
["KLM 4x1,0 25 ohm / km",null,null,null,{"$f":"IF(G230<=15,\"OK\",\"TOO LONG\")","v":"OK"},{"$f":"IF(H230<=15,\"OK\",\"TOO LONG\")","v":"OK"}]
[]
[]
[]
["Loop cabling equal distance"]
[null,null,null,null,"jännite 25V-40V","N89 28V-40V"]
[null,null,null,null,null,null,"ELQYB/KLM 4x1.0\n25 ohm/km",null,"ELQYB/KLM 2x1.0\n50 ohms/km",null,"KLMA 4x0.8\n37 ohm/km",null,"KLMA 2x0.8\n74 ohm/km",null,"[m]",null,"metrit"]
[null,null,null,null,null,null,"I, [mA]","I, [mA]","I, [mA]","I, [mA]","I, [mA]","I, [mA]","I, [mA]","I, [mA]"]
[null,null,null,null,null,null,{"$f":"((15/(2*25*Q186*0.001))*1000)","v":6000},{"$f":"((15/(2*25*P186*0.001))*1000)","v":300},{"$f":"((15/(2*50*Q186*0.001))*1000)","v":3000},{"$f":"((15/(2*50*P186*0.001))*1000)","v":150},{"$f":"((15/(2*37*Q186*0.001))*1000)","v":4054.0540540540537},{"$f":"((15/(2*37*P186*0.001))*1000)","v":202.70270270270271},{"$f":"((15/(2*74*Q186*0.001))*1000)","v":2027.0270270270269},{"$f":"((15/(2*74*P186*0.001))*1000)","v":101.35135135135135},0,1000,50]
[null,null,null,null,null,null,3000,{"$f":"((15/(2*25*P187*0.001))*1000)","v":333.33333333333331},1500,{"$f":"((15/(2*50*P187*0.001))*1000)","v":166.66666666666666},2027.0270270270269,{"$f":"((15/(2*37*P187*0.001))*1000)","v":225.22522522522524},1013.5135135135134,{"$f":"((15/(2*74*P187*0.001))*1000)","v":112.61261261261262},280,900,100]
[null,null,null,null,null,null,1500,375,750,187.5,1013.5135135135134,253.37837837837836,506.75675675675672,126.68918918918918,500,800,200]
[null,null,null,null,null,null,1000,428.57142857142856,500,214.28571428571428,675.67567567567562,289.57528957528956,337.83783783783781,144.78764478764478,1000,700,300]
[null,null,null,null,null,null,750,500,375,250,506.75675675675672,337.83783783783781,253.37837837837836,168.91891891891891,1500,600,400]
[null,null,null,null,null,null,600,600,300,300,405.40540540540542,405.40540540540542,202.70270270270271,202.70270270270271,2000,500,500]
[null,null,null,null,null,null,500,750,250,375,337.83783783783781,506.75675675675672,168.91891891891891,253.37837837837836,2001,400,600]
[null,null,null,null,null,null,428.57142857142856,1000,214.28571428571428,500,289.57528957528956,675.67567567567562,144.78764478764478,337.83783783783781,null,300,700]
[null,null,null,null,null,null,375,1500,187.5,750,253.37837837837836,1013.5135135135134,126.68918918918918,506.75675675675672,null,200,800]
[null,null,null,null,null,null,333.33333333333331,3000,166.66666666666666,1500,225.22522522522524,2027.0270270270269,112.61261261261262,1013.5135135135134,null,100,900,null,null,null,null,null,null,"Kaapelin ominaisresistanssi",null,74,"ohm/km",null,null,null,null,null,null,null,null,null,null,null,null,null,null,"Kaapelin ominaisresistanssi",null,74,"ohm/km"]
[null,null,null,null,null,null,{"$f":"((15/(2*25*Q196*0.001))*1000)","v":300},6000,{"$f":"((15/(2*50*Q196*0.001))*1000)","v":150},3000,{"$f":"((15/(2*37*Q196*0.001))*1000)","v":202.70270270270271},4054.0540540540537,{"$f":"((15/(2*74*Q196*0.001))*1000)","v":101.35135135135135},2027.0270270270269,null,50,1000,null,null,null,null,null,null,"Kaapelivastus/silmukka",null,{"$f":"((Z195*Z197)/1000)","v":7.3999999999999996E-2},"ohm",null,null,null,null,null,null,null,null,null,null,null,null,null,null,"Kaapelivastus/silmukka",null,{"$f":"((AR195*AR197)/1000)","v":7.3999999999999996E-2},"ohm"]
["Loop cabling worst case",null,null,null,null,null,null,null,null,null,null,null,null,null,null,null,null,null,null,null,null,null,null,"Kaapelin pituus",null,{"$f":"E148","v":1},"m",null,null,null,null,null,null,null,null,null,null,null,null,null,null,"Kaapelin pituus",null,{"$f":"F148","v":1},"m"]
[null,null,null,null,null,null,null,null,null,null,null,null,null,null,null,null,null,null,null,null,null,null,null,"Kuormitus",null,{"$f":"(E150/1000)","v":0},"A",null,null,null,null,null,null,null,null,null,null,null,null,null,null,"Kuormitus",null,{"$f":"(F150/1000)","v":0},"A"]
[null,null,null,null,null,null,"ELQYB/KLM 4x1.0\n25 ohm/km",null,"ELQYB/KLM 2x1.0\n50 ohms/km",null,"KLMA 4x0.8\n37 ohm/km",null,"KLMA 2x0.8\n74 ohm/km",null,"[m]"]
[null,null,null,null,null,null,"I, [mA]","I, [mA]","I, [mA]","I, [mA]","I, [mA]","I, [mA]","I, [mA]"]
[null,null,null,null,null,null,1230,3000,635,3000,835,3000,415,3000,1000,0,null,null,null,null,null,null,"R1",{"$f":"(Z196/10/2)","v":3.6999999999999997E-3},null,null,null,null,null,null,null,null,null,null,null,null,null,null,null,null,"R1",{"$f":"(AR196/10/2)","v":3.6999999999999997E-3}]
[null,null,null,null,null,null,1370,3000,680,3000,925,3000,460,3000,900,100,null,null,null,null,null,1,"R2",{"$f":"(31/(Z198/10))","v":{"$error":"#DIV/0!"}},null,{"$f":"(X201+X202+X203)","v":{"$error":"#DIV/0!"}},{"$f":"(-X202)","v":{"$error":"#DIV/0!"}},0,0,0,0,0,0,0,0,null,40,null,null,null,"R2",{"$f":"(31/(AR198/10))","v":{"$error":"#DIV/0!"}},null,{"$f":"(AP201+AP202+AP203)","v":{"$error":"#DIV/0!"}},{"$f":"(-AP202)","v":{"$error":"#DIV/0!"}},0,0,0,0,0,0,0,0,null,40]
[null,null,null,null,null,null,1540,3000,770,3000,1040,3000,520,2000,800,200,null,null,null,null,null,null,"R3",{"$f":"(Z196/10/2)","v":3.6999999999999997E-3},null,{"$f":"(-X202)","v":{"$error":"#DIV/0!"}},{"$f":"(X204+X205+X206+X202)","v":{"$error":"#DIV/0!"}},{"$f":"(-X205)","v":{"$error":"#DIV/0!"}},0,0,0,0,0,0,0,null,0,null,null,null,"R3",{"$f":"(AR196/10/2)","v":3.6999999999999997E-3},null,{"$f":"(-AP202)","v":{"$error":"#DIV/0!"}},{"$f":"(AP204+AP205+AP206+AP202)","v":{"$error":"#DIV/0!"}},{"$f":"(-AP205)","v":{"$error":"#DIV/0!"}},0,0,0,0,0,0,0,null,0]
[null,null,null,null,null,null,1765,3000,880,2000,1190,3000,595,1350,700,300,null,null,null,null,null,null,"R4",{"$f":"(Z196/10/2)","v":3.6999999999999997E-3},null,0,{"$f":"(-X205)","v":{"$error":"#DIV/0!"}},{"$f":"(X207+X208+X209+X205)","v":{"$error":"#DIV/0!"}},{"$f":"(-X208)","v":{"$error":"#DIV/0!"}},0,0,0,0,0,0,null,0,null,null,null,"R4",{"$f":"(AR196/10/2)","v":3.6999999999999997E-3},null,0,{"$f":"(-AP205)","v":{"$error":"#DIV/0!"}},{"$f":"(AP207+AP208+AP209+AP205)","v":{"$error":"#DIV/0!"}},{"$f":"(-AP208)","v":{"$error":"#DIV/0!"}},0,0,0,0,0,0,null,0]
[null,null,null,null,null,null,2000,3000,1030,1540,1380,2000,695,1040,600,400,null,null,null,null,null,2,"R5",{"$f":"(31/(Z198/10))","v":{"$error":"#DIV/0!"}},null,0,0,{"$f":"(-X208)","v":{"$error":"#DIV/0!"}},{"$f":"(X210+X211+X212+X208)","v":{"$error":"#DIV/0!"}},{"$f":"(-X211)","v":{"$error":"#DIV/0!"}},0,0,0,0,0,null,0,null,null,null,"R5",{"$f":"(31/(AR198/10))","v":{"$error":"#DIV/0!"}},null,0,0,{"$f":"(-AP208)","v":{"$error":"#DIV/0!"}},{"$f":"(AP210+AP211+AP212+AP208)","v":{"$error":"#DIV/0!"}},{"$f":"(-AP211)","v":{"$error":"#DIV/0!"}},0,0,0,0,0,null,0]
[null,null,null,null,null,null,2000,3000,1235,1235,1670,1670,835,835,500,500,null,null,null,null,null,null,"R6",{"$f":"(Z196/10/2)","v":3.6999999999999997E-3},null,0,0,0,{"$f":"(-X211)","v":{"$error":"#DIV/0!"}},{"$f":"(X213+X214+X215+X211)","v":{"$error":"#DIV/0!"}},{"$f":"(-X214)","v":{"$error":"#DIV/0!"}},0,0,0,0,null,0,null,null,null,"R6",{"$f":"(AR196/10/2)","v":3.6999999999999997E-3},null,0,0,0,{"$f":"(-AP211)","v":{"$error":"#DIV/0!"}},{"$f":"(AP213+AP214+AP215+AP211)","v":{"$error":"#DIV/0!"}},{"$f":"(-AP214)","v":{"$error":"#DIV/0!"}},0,0,0,0,null,0]
[null,null,null,null,null,null,2000,2000,1540,1030,2000,1380,1040,695,400,600,null,null,null,null,null,null,"R7",{"$f":"(Z196/10/2)","v":3.6999999999999997E-3},null,0,0,0,0,{"$f":"(-X214)","v":{"$error":"#DIV/0!"}},{"$f":"(X216+X217+X218+X214)","v":{"$error":"#DIV/0!"}},{"$f":"(-X217)","v":{"$error":"#DIV/0!"}},0,0,0,null,0,null,null,null,"R7",{"$f":"(AR196/10/2)","v":3.6999999999999997E-3},null,0,0,0,0,{"$f":"(-AP214)","v":{"$error":"#DIV/0!"}},{"$f":"(AP216+AP217+AP218+AP214)","v":{"$error":"#DIV/0!"}},{"$f":"(-AP217)","v":{"$error":"#DIV/0!"}},0,0,0,null,0]
[null,null,null,null,null,null,2000,1765,2000,880,2000,1190,1350,595,300,700,null,null,null,null,null,3,"R8",{"$f":"(31/(Z198/10))","v":{"$error":"#DIV/0!"}},null,0,0,0,0,0,{"$f":"(-X217)","v":{"$error":"#DIV/0!"}},{"$f":"(X216+X217+X218+X214)","v":{"$error":"#DIV/0!"}},{"$f":"(-X220)","v":{"$error":"#DIV/0!"}},0,0,null,0,null,null,null,"R8",{"$f":"(31/(AR198/10))","v":{"$error":"#DIV/0!"}},null,0,0,0,0,0,{"$f":"(-AP217)","v":{"$error":"#DIV/0!"}},{"$f":"(AP216+AP217+AP218+AP214)","v":{"$error":"#DIV/0!"}},{"$f":"(-AP220)","v":{"$error":"#DIV/0!"}},0,0,null,0]
[null,null,null,null,null,null,2000,1540,2000,770,2000,1040,2000,520,200,800,null,null,null,null,null,null,"R9",{"$f":"(Z196/10/2)","v":3.6999999999999997E-3},null,0,0,0,0,0,0,{"$f":"(-X220)","v":{"$error":"#DIV/0!"}},{"$f":"(X222+X223+X224+X220)","v":{"$error":"#DIV/0!"}},{"$f":"(-X223)","v":{"$error":"#DIV/0!"}},0,null,0,null,null,null,"R9",{"$f":"(AR196/10/2)","v":3.6999999999999997E-3},null,0,0,0,0,0,0,{"$f":"(-AP220)","v":{"$error":"#DIV/0!"}},{"$f":"(AP222+AP223+AP224+AP220)","v":{"$error":"#DIV/0!"}},{"$f":"(-AP223)","v":{"$error":"#DIV/0!"}},0,null,0]
[null,null,null,null,null,null,2000,1370,2000,680,2000,925,2000,460,100,900,null,null,null,null,null,null,"R10",{"$f":"(Z196/10/2)","v":3.6999999999999997E-3},null,0,0,0,0,0,0,0,{"$f":"(-X223)","v":{"$error":"#DIV/0!"}},{"$f":"(X225+X226+X227+X223)","v":{"$error":"#DIV/0!"}},{"$f":"(-X226)","v":{"$error":"#DIV/0!"}},null,0,null,null,null,"R10",{"$f":"(AR196/10/2)","v":3.6999999999999997E-3},null,0,0,0,0,0,0,0,{"$f":"(-AP223)","v":{"$error":"#DIV/0!"}},{"$f":"(AP225+AP226+AP227+AP223)","v":{"$error":"#DIV/0!"}},{"$f":"(-AP226)","v":{"$error":"#DIV/0!"}},null,0]
[null,null,null,null,null,null,2000,1230,2000,610,2000,835,2000,415,0,1000,null,null,null,null,null,4,"R11",{"$f":"(31/(Z198/10))","v":{"$error":"#DIV/0!"}},null,0,0,0,0,0,0,0,0,{"$f":"(-X226)","v":{"$error":"#DIV/0!"}},{"$f":"(X228+X229+X230+X226)","v":{"$error":"#DIV/0!"}},null,0,null,null,null,"R11",{"$f":"(31/(AR198/10))","v":{"$error":"#DIV/0!"}},null,0,0,0,0,0,0,0,0,{"$f":"(-AP226)","v":{"$error":"#DIV/0!"}},{"$f":"(AP228+AP229+AP230+AP226)","v":{"$error":"#DIV/0!"}},null,0]
[null,null,null,null,null,null,null,null,null,null,null,null,null,null,null,null,null,null,null,null,null,null,"R12",{"$f":"(Z196/10/2)","v":3.6999999999999997E-3},null,null,null,null,null,null,null,null,null,null,null,null,null,null,null,null,"R12",{"$f":"(AR196/10/2)","v":3.6999999999999997E-3}]
[null,null,null,null,null,null,null,null,null,null,null,null,null,null,null,null,null,null,null,null,null,null,"R13",{"$f":"(Z196/10/2)","v":3.6999999999999997E-3},null,null,null,null,null,null,null,null,null,null,null,null,null,null,null,null,"R13",{"$f":"(AR196/10/2)","v":3.6999999999999997E-3}]
[null,null,null,null,null,null,null,null,null,null,null,null,null,null,null,null,null,null,null,null,null,5,"R14",{"$f":"(31/(Z198/10))","v":{"$error":"#DIV/0!"}},null,{"$f":"MINVERSE(Z202:AI211)","v":{"$error":"#DIV/0!"}},null,null,null,null,null,null,null,null,null,null,{"$f":"MMULT(_xlfn.ANCHORARRAY(Z214),AK202:AK211)","v":{"$error":"#DIV/0!"}},null,null,null,"R14",{"$f":"(31/(AR198/10))","v":{"$error":"#DIV/0!"}},null,{"$f":"MINVERSE(AR202:BA211)","v":{"$error":"#DIV/0!"}},null,null,null,null,null,null,null,null,null,null,{"$f":"MMULT(_xlfn.ANCHORARRAY(AR214),BC202:BC211)","v":{"$error":"#DIV/0!"}}]
[null,null,null,null,null,null,null,null,null,null,null,null,null,null,null,null,null,null,null,null,null,null,"R15",{"$f":"(Z196/10/2)","v":3.6999999999999997E-3},null,null,null,null,null,null,null,null,null,null,null,null,null,null,null,null,"R15",{"$f":"(AR196/10/2)","v":3.6999999999999997E-3}]
[null,null,null,null,null,null,null,null,null,null,null,null,null,null,null,null,null,null,null,null,null,null,"R16",{"$f":"(Z196/10/2)","v":3.6999999999999997E-3},null,null,null,null,null,null,null,null,null,null,null,null,null,null,null,null,"R16",{"$f":"(AR196/10/2)","v":3.6999999999999997E-3}]
[null,null,null,null,null,null,null,null,null,null,null,null,null,null,null,null,null,null,null,null,null,6,"R17",{"$f":"(31/(Z198/10))","v":{"$error":"#DIV/0!"}},null,null,null,null,null,null,null,null,null,null,null,null,null,null,null,null,"R17",{"$f":"(31/(AR198/10))","v":{"$error":"#DIV/0!"}}]
[null,null,null,null,null,null,null,null,null,null,null,null,null,null,null,null,null,null,null,null,null,null,"R18",{"$f":"(Z196/10/2)","v":3.6999999999999997E-3},null,null,null,null,null,null,null,null,null,null,null,null,null,null,null,null,"R18",{"$f":"(AR196/10/2)","v":3.6999999999999997E-3}]
[null,null,null,null,null,null,null,null,null,null,null,null,null,null,null,null,null,null,null,null,null,null,"R19",{"$f":"(Z196/10/2)","v":3.6999999999999997E-3},null,null,null,null,null,null,null,null,null,null,null,null,null,null,null,null,"R19",{"$f":"(AR196/10/2)","v":3.6999999999999997E-3}]
[null,null,null,null,null,null,null,null,null,null,null,null,null,null,null,null,null,null,null,null,null,7,"R20",{"$f":"(31/(Z198/10))","v":{"$error":"#DIV/0!"}},null,null,null,null,null,null,null,null,null,null,null,null,null,null,null,null,"R20",{"$f":"(31/(AR198/10))","v":{"$error":"#DIV/0!"}}]
[null,null,null,null,null,null,null,null,null,null,null,null,null,null,null,null,null,null,null,null,null,null,"R21",{"$f":"(Z196/10/2)","v":3.6999999999999997E-3},null,null,null,null,null,null,null,null,null,null,null,null,null,null,null,null,"R21",{"$f":"(AR196/10/2)","v":3.6999999999999997E-3}]
[null,null,null,null,null,null,null,null,null,null,null,null,null,null,null,null,null,null,null,null,null,null,"R22",{"$f":"(Z196/10/2)","v":3.6999999999999997E-3},null,null,null,null,null,null,null,null,null,null,null,null,null,null,null,null,"R22",{"$f":"(AR196/10/2)","v":3.6999999999999997E-3}]
[null,null,null,null,null,null,null,null,null,null,null,null,null,null,null,null,null,null,null,null,null,8,"R23",{"$f":"(31/(Z198/10))","v":{"$error":"#DIV/0!"}},null,null,null,null,null,null,null,null,null,null,null,null,null,null,null,null,"R23",{"$f":"(31/(AR198/10))","v":{"$error":"#DIV/0!"}}]
[null,null,null,null,null,null,null,null,null,null,null,null,null,null,null,null,null,null,null,null,null,null,"R24",{"$f":"(Z196/10/2)","v":3.6999999999999997E-3},null,null,null,null,null,null,null,null,null,null,null,null,null,null,null,null,"R24",{"$f":"(AR196/10/2)","v":3.6999999999999997E-3}]
[null,null,null,null,null,null,null,null,null,null,null,null,null,null,null,null,null,null,null,null,null,null,"R25",{"$f":"(Z196/10/2)","v":3.6999999999999997E-3},null,null,null,null,null,null,null,null,null,null,null,null,null,"UR30",{"$f":"(X229*AK223)","v":{"$error":"#DIV/0!"}},null,"R25",{"$f":"(AR196/10/2)","v":3.6999999999999997E-3},null,null,null,null,null,null,null,null,null,null,null,null,null,"UR30",{"$f":"(AP229*BC223)","v":{"$error":"#DIV/0!"}}]
[null,null,null,null,null,null,"Worst case jännitehäviö",null,null,null,null,null,null,null,null,null,null,null,null,null,null,9,"R26",{"$f":"(31/(Z198/10))","v":{"$error":"#DIV/0!"}},null,null,null,null,null,null,null,null,null,null,null,null,null,null,null,null,"R26",{"$f":"(31/(AR198/10))","v":{"$error":"#DIV/0!"}}]
["KLMA 2x0.8 74 ohm / km",null,null,null,null,null,{"$f":"((E150/1000)*2*74*(E148/1000))","v":0},{"$f":"((F150/1000)*2*74*(F148/1000))","v":0},null,null,null,null,null,null,null,null,null,null,null,null,null,null,"R27",{"$f":"(Z196/10/2)","v":3.6999999999999997E-3},null,null,null,null,null,null,null,null,null,null,null,null,null,null,null,null,"R27",{"$f":"(AR196/10/2)","v":3.6999999999999997E-3}]
["KLMA 4x0.8 37 ohm / km",null,null,null,null,null,{"$f":"((E150/1000)*2*37*(E148/1000))","v":0},{"$f":"((F150/1000)*2*37*(F148/1000))","v":0},null,null,null,null,null,null,null,null,null,null,null,null,null,null,"R28",{"$f":"(Z196/10/2)","v":3.6999999999999997E-3},null,null,null,null,null,null,null,null,null,null,null,null,null,null,null,null,"R28",{"$f":"(AR196/10/2)","v":3.6999999999999997E-3}]
["ELQYB 2x1,0 50 ohm / km",null,null,null,null,null,{"$f":"((E150/1000)*2*50*(E148/1000))","v":0},{"$f":"((F150/1000)*2*50*(F148/1000))","v":0},null,null,null,null,null,null,null,null,null,null,null,null,null,10,"R29",{"$f":"(31/(Z198/10))","v":{"$error":"#DIV/0!"}},null,null,null,null,null,null,null,null,null,null,null,null,null,null,null,null,"R29",{"$f":"(31/(AR198/10))","v":{"$error":"#DIV/0!"}}]
["ELQYB 4x1,0 25 ohm / km",null,null,null,null,null,{"$f":"((E150/1000)*2*25*(E148/1000))","v":0},{"$f":"((F150/1000)*2*25*(F148/1000))","v":0},null,null,null,null,null,null,null,null,null,null,null,null,null,null,"R30",{"$f":"(Z196/10/2)","v":3.6999999999999997E-3},null,null,null,null,null,null,null,null,null,null,null,null,null,null,null,null,"R30",{"$f":"(AR196/10/2)","v":3.6999999999999997E-3}]
[]
[]
[null,null,null,null,null,null,null,null,null,null,null,null,null,null,null,null,null,null,null,null,null,null,null,"Kaapelin ominaisresistanssi",null,37,"ohm/km",null,null,null,null,null,null,null,null,null,null,null,null,null,null,"Kaapelin ominaisresistanssi",null,37,"ohm/km"]
[null,null,null,null,null,null,null,null,null,null,null,null,null,null,null,null,null,null,null,null,null,null,null,"Kaapelivastus/silmukka",null,{"$f":"((Z233*Z235)/1000)","v":3.6999999999999998E-2},"ohm",null,null,null,null,null,null,null,null,null,null,null,null,null,null,"Kaapelivastus/silmukka",null,{"$f":"((AR233*AR235)/1000)","v":3.6999999999999998E-2},"ohm"]
[null,null,null,null,null,null,null,null,null,null,null,null,null,null,null,null,null,null,null,null,null,null,null,"Kaapelin pituus",null,{"$f":"E148","v":1},"m",null,null,null,null,null,null,null,null,null,null,null,null,null,null,"Kaapelin pituus",null,{"$f":"F148","v":1},"m"]
[null,null,null,null,null,null,null,null,null,null,null,null,null,null,null,null,null,null,null,null,null,null,null,"Kuormitus",null,{"$f":"(E150/1000)","v":0},"A",null,null,null,null,null,null,null,null,null,null,null,null,null,null,"Kuormitus",null,{"$f":"(F150/1000)","v":0},"A"]
[]
[]
[null,null,null,null,null,null,null,null,null,null,null,null,null,null,null,null,null,null,null,null,null,null,"R1",{"$f":"(Z234/10/2)","v":1.8499999999999999E-3},null,null,null,null,null,null,null,null,null,null,null,null,null,null,null,null,"R1",{"$f":"(AR234/10/2)","v":1.8499999999999999E-3}]
[null,null,null,null,null,null,null,null,null,null,null,null,null,null,null,null,null,null,null,null,null,null,"R2",{"$f":"(31/(Z236/10))","v":{"$error":"#DIV/0!"}},null,{"$f":"(X239+X240+X241)","v":{"$error":"#DIV/0!"}},{"$f":"(-X240)","v":{"$error":"#DIV/0!"}},0,0,0,0,0,0,0,0,null,40,null,null,null,"R2",{"$f":"(31/(AR236/10))","v":{"$error":"#DIV/0!"}},null,{"$f":"(AP239+AP240+AP241)","v":{"$error":"#DIV/0!"}},{"$f":"(-AP240)","v":{"$error":"#DIV/0!"}},0,0,0,0,0,0,0,0,null,40]
[null,null,null,null,null,null,null,null,null,null,null,null,null,null,null,null,null,null,null,null,null,null,"R3",{"$f":"(Z234/10/2)","v":1.8499999999999999E-3},null,{"$f":"(-X240)","v":{"$error":"#DIV/0!"}},{"$f":"(X242+X243+X244+X240)","v":{"$error":"#DIV/0!"}},{"$f":"(-X243)","v":{"$error":"#DIV/0!"}},0,0,0,0,0,0,0,null,0,null,null,null,"R3",{"$f":"(AR234/10/2)","v":1.8499999999999999E-3},null,{"$f":"(-AP240)","v":{"$error":"#DIV/0!"}},{"$f":"(AP242+AP243+AP244+AP240)","v":{"$error":"#DIV/0!"}},{"$f":"(-AP243)","v":{"$error":"#DIV/0!"}},0,0,0,0,0,0,0,null,0]
[null,null,null,null,null,null,null,null,null,null,null,null,null,null,null,null,null,null,null,null,null,null,"R4",{"$f":"(Z234/10/2)","v":1.8499999999999999E-3},null,0,{"$f":"(-X243)","v":{"$error":"#DIV/0!"}},{"$f":"(X245+X246+X247+X243)","v":{"$error":"#DIV/0!"}},{"$f":"(-X246)","v":{"$error":"#DIV/0!"}},0,0,0,0,0,0,null,0,null,null,null,"R4",{"$f":"(AR234/10/2)","v":1.8499999999999999E-3},null,0,{"$f":"(-AP243)","v":{"$error":"#DIV/0!"}},{"$f":"(AP245+AP246+AP247+AP243)","v":{"$error":"#DIV/0!"}},{"$f":"(-AP246)","v":{"$error":"#DIV/0!"}},0,0,0,0,0,0,null,0]
[null,null,null,null,null,null,null,null,null,null,null,null,null,null,null,null,null,null,null,null,null,null,"R5",{"$f":"(31/(Z236/10))","v":{"$error":"#DIV/0!"}},null,0,0,{"$f":"(-X246)","v":{"$error":"#DIV/0!"}},{"$f":"(X248+X249+X250+X246)","v":{"$error":"#DIV/0!"}},{"$f":"(-X249)","v":{"$error":"#DIV/0!"}},0,0,0,0,0,null,0,null,null,null,"R5",{"$f":"(31/(AR236/10))","v":{"$error":"#DIV/0!"}},null,0,0,{"$f":"(-AP246)","v":{"$error":"#DIV/0!"}},{"$f":"(AP248+AP249+AP250+AP246)","v":{"$error":"#DIV/0!"}},{"$f":"(-AP249)","v":{"$error":"#DIV/0!"}},0,0,0,0,0,null,0]
[null,null,null,null,null,null,null,null,null,null,null,null,null,null,null,null,null,null,null,null,null,null,"R6",{"$f":"(Z234/10/2)","v":1.8499999999999999E-3},null,0,0,0,{"$f":"(-X249)","v":{"$error":"#DIV/0!"}},{"$f":"(X251+X252+X253+X249)","v":{"$error":"#DIV/0!"}},{"$f":"(-X252)","v":{"$error":"#DIV/0!"}},0,0,0,0,null,0,null,null,null,"R6",{"$f":"(AR234/10/2)","v":1.8499999999999999E-3},null,0,0,0,{"$f":"(-AP249)","v":{"$error":"#DIV/0!"}},{"$f":"(AP251+AP252+AP253+AP249)","v":{"$error":"#DIV/0!"}},{"$f":"(-AP252)","v":{"$error":"#DIV/0!"}},0,0,0,0,null,0]
[null,null,null,null,null,null,null,null,null,null,null,null,null,null,null,null,null,null,null,null,null,null,"R7",{"$f":"(Z234/10/2)","v":1.8499999999999999E-3},null,0,0,0,0,{"$f":"(-X252)","v":{"$error":"#DIV/0!"}},{"$f":"(X254+X255+X256+X252)","v":{"$error":"#DIV/0!"}},{"$f":"(-X255)","v":{"$error":"#DIV/0!"}},0,0,0,null,0,null,null,null,"R7",{"$f":"(AR234/10/2)","v":1.8499999999999999E-3},null,0,0,0,0,{"$f":"(-AP252)","v":{"$error":"#DIV/0!"}},{"$f":"(AP254+AP255+AP256+AP252)","v":{"$error":"#DIV/0!"}},{"$f":"(-AP255)","v":{"$error":"#DIV/0!"}},0,0,0,null,0]
[null,null,null,null,null,null,null,null,null,null,null,null,null,null,null,null,null,null,null,null,null,null,"R8",{"$f":"(31/(Z236/10))","v":{"$error":"#DIV/0!"}},null,0,0,0,0,0,{"$f":"(-X255)","v":{"$error":"#DIV/0!"}},{"$f":"(X254+X255+X256+X252)","v":{"$error":"#DIV/0!"}},{"$f":"(-X258)","v":{"$error":"#DIV/0!"}},0,0,null,0,null,null,null,"R8",{"$f":"(31/(AR236/10))","v":{"$error":"#DIV/0!"}},null,0,0,0,0,0,{"$f":"(-AP255)","v":{"$error":"#DIV/0!"}},{"$f":"(AP254+AP255+AP256+AP252)","v":{"$error":"#DIV/0!"}},{"$f":"(-AP258)","v":{"$error":"#DIV/0!"}},0,0,null,0]
[null,null,null,null,null,null,null,null,null,null,null,null,null,null,null,null,null,null,null,null,null,null,"R9",{"$f":"(Z234/10/2)","v":1.8499999999999999E-3},null,0,0,0,0,0,0,{"$f":"(-X258)","v":{"$error":"#DIV/0!"}},{"$f":"(X260+X261+X262+X258)","v":{"$error":"#DIV/0!"}},{"$f":"(-X261)","v":{"$error":"#DIV/0!"}},0,null,0,null,null,null,"R9",{"$f":"(AR234/10/2)","v":1.8499999999999999E-3},null,0,0,0,0,0,0,{"$f":"(-AP258)","v":{"$error":"#DIV/0!"}},{"$f":"(AP260+AP261+AP262+AP258)","v":{"$error":"#DIV/0!"}},{"$f":"(-AP261)","v":{"$error":"#DIV/0!"}},0,null,0]
[null,null,null,null,null,null,null,null,null,null,null,null,null,null,null,null,null,null,null,null,null,null,"R10",{"$f":"(Z234/10/2)","v":1.8499999999999999E-3},null,0,0,0,0,0,0,0,{"$f":"(-X261)","v":{"$error":"#DIV/0!"}},{"$f":"(X263+X264+X265+X261)","v":{"$error":"#DIV/0!"}},{"$f":"(-X264)","v":{"$error":"#DIV/0!"}},null,0,null,null,null,"R10",{"$f":"(AR234/10/2)","v":1.8499999999999999E-3},null,0,0,0,0,0,0,0,{"$f":"(-AP261)","v":{"$error":"#DIV/0!"}},{"$f":"(AP263+AP264+AP265+AP261)","v":{"$error":"#DIV/0!"}},{"$f":"(-AP264)","v":{"$error":"#DIV/0!"}},null,0]
[null,null,null,null,null,null,null,null,null,null,null,null,null,null,null,null,null,null,null,null,null,null,"R11",{"$f":"(31/(Z236/10))","v":{"$error":"#DIV/0!"}},null,0,0,0,0,0,0,0,0,{"$f":"(-X264)","v":{"$error":"#DIV/0!"}},{"$f":"(X266+X267+X268+X264)","v":{"$error":"#DIV/0!"}},null,0,null,null,null,"R11",{"$f":"(31/(AR236/10))","v":{"$error":"#DIV/0!"}},null,0,0,0,0,0,0,0,0,{"$f":"(-AP264)","v":{"$error":"#DIV/0!"}},{"$f":"(AP266+AP267+AP268+AP264)","v":{"$error":"#DIV/0!"}},null,0]
[null,null,null,null,null,null,null,null,null,null,null,null,null,null,null,null,null,null,null,null,null,null,"R12",{"$f":"(Z234/10/2)","v":1.8499999999999999E-3},null,null,null,null,null,null,null,null,null,null,null,null,null,null,null,null,"R12",{"$f":"(AR234/10/2)","v":1.8499999999999999E-3}]
[null,null,null,null,null,null,null,null,null,null,null,null,null,null,null,null,null,null,null,null,null,null,"R13",{"$f":"(Z234/10/2)","v":1.8499999999999999E-3},null,null,null,null,null,null,null,null,null,null,null,null,null,null,null,null,"R13",{"$f":"(AR234/10/2)","v":1.8499999999999999E-3}]
[null,null,null,null,null,null,null,null,null,null,null,null,null,null,null,null,null,null,null,null,null,null,"R14",{"$f":"(31/(Z236/10))","v":{"$error":"#DIV/0!"}},null,{"$f":"MINVERSE(Z240:AI249)","v":{"$error":"#DIV/0!"}},null,null,null,null,null,null,null,null,null,null,{"$f":"MMULT(_xlfn.ANCHORARRAY(Z252),AK240:AK249)","v":{"$error":"#DIV/0!"}},null,null,null,"R14",{"$f":"(31/(AR236/10))","v":{"$error":"#DIV/0!"}},null,{"$f":"MINVERSE(AR240:BA249)","v":{"$error":"#DIV/0!"}},null,null,null,null,null,null,null,null,null,null,{"$f":"MMULT(_xlfn.ANCHORARRAY(AR252),BC240:BC249)","v":{"$error":"#DIV/0!"}}]
[null,null,null,null,null,null,null,null,null,null,null,null,null,null,null,null,null,null,null,null,null,null,"R15",{"$f":"(Z234/10/2)","v":1.8499999999999999E-3},null,null,null,null,null,null,null,null,null,null,null,null,null,null,null,null,"R15",{"$f":"(AR234/10/2)","v":1.8499999999999999E-3}]
[null,null,null,null,null,null,null,null,null,null,null,null,null,null,null,null,null,null,null,null,null,null,"R16",{"$f":"(Z234/10/2)","v":1.8499999999999999E-3},null,null,null,null,null,null,null,null,null,null,null,null,null,null,null,null,"R16",{"$f":"(AR234/10/2)","v":1.8499999999999999E-3}]
[null,null,null,null,null,null,null,null,null,null,null,null,null,null,null,null,null,null,null,null,null,null,"R17",{"$f":"(31/(Z236/10))","v":{"$error":"#DIV/0!"}},null,null,null,null,null,null,null,null,null,null,null,null,null,null,null,null,"R17",{"$f":"(31/(AR236/10))","v":{"$error":"#DIV/0!"}}]
[null,null,null,null,null,null,null,null,null,null,null,null,null,null,null,null,null,null,null,null,null,null,"R18",{"$f":"(Z234/10/2)","v":1.8499999999999999E-3},null,null,null,null,null,null,null,null,null,null,null,null,null,null,null,null,"R18",{"$f":"(AR234/10/2)","v":1.8499999999999999E-3}]
[null,null,null,null,null,null,null,null,null,null,null,null,null,null,null,null,null,null,null,null,null,null,"R19",{"$f":"(Z234/10/2)","v":1.8499999999999999E-3},null,null,null,null,null,null,null,null,null,null,null,null,null,null,null,null,"R19",{"$f":"(AR234/10/2)","v":1.8499999999999999E-3}]
[null,null,null,null,null,null,null,null,null,null,null,null,null,null,null,null,null,null,null,null,null,null,"R20",{"$f":"(31/(Z236/10))","v":{"$error":"#DIV/0!"}},null,null,null,null,null,null,null,null,null,null,null,null,null,null,null,null,"R20",{"$f":"(31/(AR236/10))","v":{"$error":"#DIV/0!"}}]
[null,null,null,null,null,null,null,null,null,null,null,null,null,null,null,null,null,null,null,null,null,null,"R21",{"$f":"(Z234/10/2)","v":1.8499999999999999E-3},null,null,null,null,null,null,null,null,null,null,null,null,null,null,null,null,"R21",{"$f":"(AR234/10/2)","v":1.8499999999999999E-3}]
[null,null,null,null,null,null,null,null,null,null,null,null,null,null,null,null,null,null,null,null,null,null,"R22",{"$f":"(Z234/10/2)","v":1.8499999999999999E-3},null,null,null,null,null,null,null,null,null,null,null,null,null,null,null,null,"R22",{"$f":"(AR234/10/2)","v":1.8499999999999999E-3}]
[null,null,null,null,null,null,null,null,null,null,null,null,null,null,null,null,null,null,null,null,null,null,"R23",{"$f":"(31/(Z236/10))","v":{"$error":"#DIV/0!"}},null,null,null,null,null,null,null,null,null,null,null,null,null,null,null,null,"R23",{"$f":"(31/(AR236/10))","v":{"$error":"#DIV/0!"}}]
[null,null,null,null,null,null,null,null,null,null,null,null,null,null,null,null,null,null,null,null,null,null,"R24",{"$f":"(Z234/10/2)","v":1.8499999999999999E-3},null,null,null,null,null,null,null,null,null,null,null,null,null,null,null,null,"R24",{"$f":"(AR234/10/2)","v":1.8499999999999999E-3}]
[null,null,null,null,null,null,null,null,null,null,null,null,null,null,null,null,null,null,null,null,null,null,"R25",{"$f":"(Z234/10/2)","v":1.8499999999999999E-3},null,null,null,null,null,null,null,null,null,null,null,null,null,"UR30",{"$f":"(X267*AK261)","v":{"$error":"#DIV/0!"}},null,"R25",{"$f":"(AR234/10/2)","v":1.8499999999999999E-3},null,null,null,null,null,null,null,null,null,null,null,null,null,"UR30",{"$f":"(AP267*BC261)","v":{"$error":"#DIV/0!"}}]
[null,null,null,null,null,null,null,null,null,null,null,null,null,null,null,null,null,null,null,null,null,null,"R26",{"$f":"(31/(Z236/10))","v":{"$error":"#DIV/0!"}},null,null,null,null,null,null,null,null,null,null,null,null,null,null,null,null,"R26",{"$f":"(31/(AR236/10))","v":{"$error":"#DIV/0!"}}]
[null,null,null,null,null,null,null,null,null,null,null,null,null,null,null,null,null,null,null,null,null,null,"R27",{"$f":"(Z234/10/2)","v":1.8499999999999999E-3},null,null,null,null,null,null,null,null,null,null,null,null,null,null,null,null,"R27",{"$f":"(AR234/10/2)","v":1.8499999999999999E-3}]
[null,null,null,null,null,null,null,null,null,null,null,null,null,null,null,null,null,null,null,null,null,null,"R28",{"$f":"(Z234/10/2)","v":1.8499999999999999E-3},null,null,null,null,null,null,null,null,null,null,null,null,null,null,null,null,"R28",{"$f":"(AR234/10/2)","v":1.8499999999999999E-3}]
[null,null,null,null,null,null,null,null,null,null,null,null,null,null,null,null,null,null,null,null,null,null,"R29",{"$f":"(31/(Z236/10))","v":{"$error":"#DIV/0!"}},null,null,null,null,null,null,null,null,null,null,null,null,null,null,null,null,"R29",{"$f":"(31/(AR236/10))","v":{"$error":"#DIV/0!"}}]
[null,null,null,null,null,null,null,null,null,null,null,null,null,null,null,null,null,null,null,null,null,null,"R30",{"$f":"(Z234/10/2)","v":1.8499999999999999E-3},null,null,null,null,null,null,null,null,null,null,null,null,null,null,null,null,"R30",{"$f":"(AR234/10/2)","v":1.8499999999999999E-3}]
[]
[]
[null,null,null,null,null,null,null,null,null,null,null,null,null,null,null,null,null,null,null,null,null,null,null,"Kaapelin ominaisresistanssi",null,50,"ohm/km",null,null,null,null,null,null,null,null,null,null,null,null,null,null,"Kaapelin ominaisresistanssi",null,50,"ohm/km"]
[null,null,null,null,null,null,null,null,null,null,null,null,null,null,null,null,null,null,null,null,null,null,null,"Kaapelivastus/silmukka",null,{"$f":"((Z271*Z273)/1000)","v":0.05},"ohm",null,null,null,null,null,null,null,null,null,null,null,null,null,null,"Kaapelivastus/silmukka",null,{"$f":"((AR271*AR273)/1000)","v":0.05},"ohm"]
[null,null,null,null,null,null,null,null,null,null,null,null,null,null,null,null,null,null,null,null,null,null,null,"Kaapelin pituus",null,{"$f":"E148","v":1},"m",null,null,null,null,null,null,null,null,null,null,null,null,null,null,"Kaapelin pituus",null,{"$f":"F148","v":1},"m"]
[null,null,null,null,null,null,null,null,null,null,null,null,null,null,null,null,null,null,null,null,null,null,null,"Kuormitus",null,{"$f":"E150/1000","v":0},"A",null,null,null,null,null,null,null,null,null,null,null,null,null,null,"Kuormitus",null,{"$f":"(F150/1000)","v":0},"A"]
[]
[]
[null,null,null,null,null,null,null,null,null,null,null,null,null,null,null,null,null,null,null,null,null,null,"R1",{"$f":"(Z272/10/2)","v":2.5000000000000001E-3},null,null,null,null,null,null,null,null,null,null,null,null,null,null,null,null,"R1",{"$f":"(AR272/10/2)","v":2.5000000000000001E-3}]
[null,null,null,null,null,null,null,null,null,null,null,null,null,null,null,null,null,null,null,null,null,null,"R2",{"$f":"(31/(Z274/10))","v":{"$error":"#DIV/0!"}},null,{"$f":"(X277+X278+X279)","v":{"$error":"#DIV/0!"}},{"$f":"(-X278)","v":{"$error":"#DIV/0!"}},0,0,0,0,0,0,0,0,null,40,null,null,null,"R2",{"$f":"(31/(AR274/10))","v":{"$error":"#DIV/0!"}},null,{"$f":"(AP277+AP278+AP279)","v":{"$error":"#DIV/0!"}},{"$f":"(-AP278)","v":{"$error":"#DIV/0!"}},0,0,0,0,0,0,0,0,null,40]
[null,null,null,null,null,null,null,null,null,null,null,null,null,null,null,null,null,null,null,null,null,null,"R3",{"$f":"(Z272/10/2)","v":2.5000000000000001E-3},null,{"$f":"(-X278)","v":{"$error":"#DIV/0!"}},{"$f":"(X280+X281+X282+X278)","v":{"$error":"#DIV/0!"}},{"$f":"(-X281)","v":{"$error":"#DIV/0!"}},0,0,0,0,0,0,0,null,0,null,null,null,"R3",{"$f":"(AR272/10/2)","v":2.5000000000000001E-3},null,{"$f":"(-AP278)","v":{"$error":"#DIV/0!"}},{"$f":"(AP280+AP281+AP282+AP278)","v":{"$error":"#DIV/0!"}},{"$f":"(-AP281)","v":{"$error":"#DIV/0!"}},0,0,0,0,0,0,0,null,0]
[null,null,null,null,null,null,null,null,null,null,null,null,null,null,null,null,null,null,null,null,null,null,"R4",{"$f":"(Z272/10/2)","v":2.5000000000000001E-3},null,0,{"$f":"(-X281)","v":{"$error":"#DIV/0!"}},{"$f":"(X283+X284+X285+X281)","v":{"$error":"#DIV/0!"}},{"$f":"(-X284)","v":{"$error":"#DIV/0!"}},0,0,0,0,0,0,null,0,null,null,null,"R4",{"$f":"(AR272/10/2)","v":2.5000000000000001E-3},null,0,{"$f":"(-AP281)","v":{"$error":"#DIV/0!"}},{"$f":"(AP283+AP284+AP285+AP281)","v":{"$error":"#DIV/0!"}},{"$f":"(-AP284)","v":{"$error":"#DIV/0!"}},0,0,0,0,0,0,null,0]
[null,null,null,null,null,null,null,null,null,null,null,null,null,null,null,null,null,null,null,null,null,null,"R5",{"$f":"(31/(Z274/10))","v":{"$error":"#DIV/0!"}},null,0,0,{"$f":"(-X284)","v":{"$error":"#DIV/0!"}},{"$f":"(X286+X287+X288+X284)","v":{"$error":"#DIV/0!"}},{"$f":"(-X287)","v":{"$error":"#DIV/0!"}},0,0,0,0,0,null,0,null,null,null,"R5",{"$f":"(31/(AR274/10))","v":{"$error":"#DIV/0!"}},null,0,0,{"$f":"(-AP284)","v":{"$error":"#DIV/0!"}},{"$f":"(AP286+AP287+AP288+AP284)","v":{"$error":"#DIV/0!"}},{"$f":"(-AP287)","v":{"$error":"#DIV/0!"}},0,0,0,0,0,null,0]
[null,null,null,null,null,null,null,null,null,null,null,null,null,null,null,null,null,null,null,null,null,null,"R6",{"$f":"(Z272/10/2)","v":2.5000000000000001E-3},null,0,0,0,{"$f":"(-X287)","v":{"$error":"#DIV/0!"}},{"$f":"(X289+X290+X291+X287)","v":{"$error":"#DIV/0!"}},{"$f":"(-X290)","v":{"$error":"#DIV/0!"}},0,0,0,0,null,0,null,null,null,"R6",{"$f":"(AR272/10/2)","v":2.5000000000000001E-3},null,0,0,0,{"$f":"(-AP287)","v":{"$error":"#DIV/0!"}},{"$f":"(AP289+AP290+AP291+AP287)","v":{"$error":"#DIV/0!"}},{"$f":"(-AP290)","v":{"$error":"#DIV/0!"}},0,0,0,0,null,0]
[null,null,null,null,null,null,null,null,null,null,null,null,null,null,null,null,null,null,null,null,null,null,"R7",{"$f":"(Z272/10/2)","v":2.5000000000000001E-3},null,0,0,0,0,{"$f":"(-X290)","v":{"$error":"#DIV/0!"}},{"$f":"(X292+X293+X294+X290)","v":{"$error":"#DIV/0!"}},{"$f":"(-X293)","v":{"$error":"#DIV/0!"}},0,0,0,null,0,null,null,null,"R7",{"$f":"(AR272/10/2)","v":2.5000000000000001E-3},null,0,0,0,0,{"$f":"(-AP290)","v":{"$error":"#DIV/0!"}},{"$f":"(AP292+AP293+AP294+AP290)","v":{"$error":"#DIV/0!"}},{"$f":"(-AP293)","v":{"$error":"#DIV/0!"}},0,0,0,null,0]
[null,null,null,null,null,null,null,null,null,null,null,null,null,null,null,null,null,null,null,null,null,null,"R8",{"$f":"(31/(Z274/10))","v":{"$error":"#DIV/0!"}},null,0,0,0,0,0,{"$f":"(-X293)","v":{"$error":"#DIV/0!"}},{"$f":"(X292+X293+X294+X290)","v":{"$error":"#DIV/0!"}},{"$f":"(-X296)","v":{"$error":"#DIV/0!"}},0,0,null,0,null,null,null,"R8",{"$f":"(31/(AR274/10))","v":{"$error":"#DIV/0!"}},null,0,0,0,0,0,{"$f":"(-AP293)","v":{"$error":"#DIV/0!"}},{"$f":"(AP292+AP293+AP294+AP290)","v":{"$error":"#DIV/0!"}},{"$f":"(-AP296)","v":{"$error":"#DIV/0!"}},0,0,null,0]
[null,null,null,null,null,null,null,null,null,null,null,null,null,null,null,null,null,null,null,null,null,null,"R9",{"$f":"(Z272/10/2)","v":2.5000000000000001E-3},null,0,0,0,0,0,0,{"$f":"(-X296)","v":{"$error":"#DIV/0!"}},{"$f":"(X298+X299+X300+X296)","v":{"$error":"#DIV/0!"}},{"$f":"(-X299)","v":{"$error":"#DIV/0!"}},0,null,0,null,null,null,"R9",{"$f":"(AR272/10/2)","v":2.5000000000000001E-3},null,0,0,0,0,0,0,{"$f":"(-AP296)","v":{"$error":"#DIV/0!"}},{"$f":"(AP298+AP299+AP300+AP296)","v":{"$error":"#DIV/0!"}},{"$f":"(-AP299)","v":{"$error":"#DIV/0!"}},0,null,0]
[null,null,null,null,null,null,null,null,null,null,null,null,null,null,null,null,null,null,null,null,null,null,"R10",{"$f":"(Z272/10/2)","v":2.5000000000000001E-3},null,0,0,0,0,0,0,0,{"$f":"(-X299)","v":{"$error":"#DIV/0!"}},{"$f":"(X301+X302+X303+X299)","v":{"$error":"#DIV/0!"}},{"$f":"(-X302)","v":{"$error":"#DIV/0!"}},null,0,null,null,null,"R10",{"$f":"(AR272/10/2)","v":2.5000000000000001E-3},null,0,0,0,0,0,0,0,{"$f":"(-AP299)","v":{"$error":"#DIV/0!"}},{"$f":"(AP301+AP302+AP303+AP299)","v":{"$error":"#DIV/0!"}},{"$f":"(-AP302)","v":{"$error":"#DIV/0!"}},null,0]
[null,null,null,null,null,null,null,null,null,null,null,null,null,null,null,null,null,null,null,null,null,null,"R11",{"$f":"(31/(Z274/10))","v":{"$error":"#DIV/0!"}},null,0,0,0,0,0,0,0,0,{"$f":"(-X302)","v":{"$error":"#DIV/0!"}},{"$f":"(X304+X305+X306+X302)","v":{"$error":"#DIV/0!"}},null,0,null,null,null,"R11",{"$f":"(31/(AR274/10))","v":{"$error":"#DIV/0!"}},null,0,0,0,0,0,0,0,0,{"$f":"(-AP302)","v":{"$error":"#DIV/0!"}},{"$f":"(AP304+AP305+AP306+AP302)","v":{"$error":"#DIV/0!"}},null,0]
[null,null,null,null,null,null,null,null,null,null,null,null,null,null,null,null,null,null,null,null,null,null,"R12",{"$f":"(Z272/10/2)","v":2.5000000000000001E-3},null,null,null,null,null,null,null,null,null,null,null,null,null,null,null,null,"R12",{"$f":"(AR272/10/2)","v":2.5000000000000001E-3}]
[null,null,null,null,null,null,null,null,null,null,null,null,null,null,null,null,null,null,null,null,null,null,"R13",{"$f":"(Z272/10/2)","v":2.5000000000000001E-3},null,null,null,null,null,null,null,null,null,null,null,null,null,null,null,null,"R13",{"$f":"(AR272/10/2)","v":2.5000000000000001E-3}]
[null,null,null,null,null,null,null,null,null,null,null,null,null,null,null,null,null,null,null,null,null,null,"R14",{"$f":"(31/(Z274/10))","v":{"$error":"#DIV/0!"}},null,{"$f":"MINVERSE(Z278:AI287)","v":{"$error":"#DIV/0!"}},null,null,null,null,null,null,null,null,null,null,{"$f":"MMULT(_xlfn.ANCHORARRAY(Z290),AK278:AK287)","v":{"$error":"#DIV/0!"}},null,null,null,"R14",{"$f":"(31/(AR274/10))","v":{"$error":"#DIV/0!"}},null,{"$f":"MINVERSE(AR278:BA287)","v":{"$error":"#DIV/0!"}},null,null,null,null,null,null,null,null,null,null,{"$f":"MMULT(_xlfn.ANCHORARRAY(AR290),BC278:BC287)","v":{"$error":"#DIV/0!"}}]
[null,null,null,null,null,null,null,null,null,null,null,null,null,null,null,null,null,null,null,null,null,null,"R15",{"$f":"(Z272/10/2)","v":2.5000000000000001E-3},null,null,null,null,null,null,null,null,null,null,null,null,null,null,null,null,"R15",{"$f":"(AR272/10/2)","v":2.5000000000000001E-3}]
[null,null,null,null,null,null,null,null,null,null,null,null,null,null,null,null,null,null,null,null,null,null,"R16",{"$f":"(Z272/10/2)","v":2.5000000000000001E-3},null,null,null,null,null,null,null,null,null,null,null,null,null,null,null,null,"R16",{"$f":"(AR272/10/2)","v":2.5000000000000001E-3}]
[null,null,null,null,null,null,null,null,null,null,null,null,null,null,null,null,null,null,null,null,null,null,"R17",{"$f":"(31/(Z274/10))","v":{"$error":"#DIV/0!"}},null,null,null,null,null,null,null,null,null,null,null,null,null,null,null,null,"R17",{"$f":"(31/(AR274/10))","v":{"$error":"#DIV/0!"}}]
[null,null,null,null,null,null,null,null,null,null,null,null,null,null,null,null,null,null,null,null,null,null,"R18",{"$f":"(Z272/10/2)","v":2.5000000000000001E-3},null,null,null,null,null,null,null,null,null,null,null,null,null,null,null,null,"R18",{"$f":"(AR272/10/2)","v":2.5000000000000001E-3}]
[null,null,null,null,null,null,null,null,null,null,null,null,null,null,null,null,null,null,null,null,null,null,"R19",{"$f":"(Z272/10/2)","v":2.5000000000000001E-3},null,null,null,null,null,null,null,null,null,null,null,null,null,null,null,null,"R19",{"$f":"(AR272/10/2)","v":2.5000000000000001E-3}]
[null,null,null,null,null,null,null,null,null,null,null,null,null,null,null,null,null,null,null,null,null,null,"R20",{"$f":"(31/(Z274/10))","v":{"$error":"#DIV/0!"}},null,null,null,null,null,null,null,null,null,null,null,null,null,null,null,null,"R20",{"$f":"(31/(AR274/10))","v":{"$error":"#DIV/0!"}}]
[null,null,null,null,null,null,null,null,null,null,null,null,null,null,null,null,null,null,null,null,null,null,"R21",{"$f":"(Z272/10/2)","v":2.5000000000000001E-3},null,null,null,null,null,null,null,null,null,null,null,null,null,null,null,null,"R21",{"$f":"(AR272/10/2)","v":2.5000000000000001E-3}]
[null,null,null,null,null,null,null,null,null,null,null,null,null,null,null,null,null,null,null,null,null,null,"R22",{"$f":"(Z272/10/2)","v":2.5000000000000001E-3},null,null,null,null,null,null,null,null,null,null,null,null,null,null,null,null,"R22",{"$f":"(AR272/10/2)","v":2.5000000000000001E-3}]
[null,null,null,null,null,null,null,null,null,null,null,null,null,null,null,null,null,null,null,null,null,null,"R23",{"$f":"(31/(Z274/10))","v":{"$error":"#DIV/0!"}},null,null,null,null,null,null,null,null,null,null,null,null,null,null,null,null,"R23",{"$f":"(31/(AR274/10))","v":{"$error":"#DIV/0!"}}]
[null,null,null,null,null,null,null,null,null,null,null,null,null,null,null,null,null,null,null,null,null,null,"R24",{"$f":"(Z272/10/2)","v":2.5000000000000001E-3},null,null,null,null,null,null,null,null,null,null,null,null,null,null,null,null,"R24",{"$f":"(AR272/10/2)","v":2.5000000000000001E-3}]
[null,null,null,null,null,null,null,null,null,null,null,null,null,null,null,null,null,null,null,null,null,null,"R25",{"$f":"(Z272/10/2)","v":2.5000000000000001E-3},null,null,null,null,null,null,null,null,null,null,null,null,null,"UR30",{"$f":"(X305*AK299)","v":{"$error":"#DIV/0!"}},null,"R25",{"$f":"(AR272/10/2)","v":2.5000000000000001E-3},null,null,null,null,null,null,null,null,null,null,null,null,null,"UR30",{"$f":"(AP305*BC299)","v":{"$error":"#DIV/0!"}}]
[null,null,null,null,null,null,null,null,null,null,null,null,null,null,null,null,null,null,null,null,null,null,"R26",{"$f":"(31/(Z274/10))","v":{"$error":"#DIV/0!"}},null,null,null,null,null,null,null,null,null,null,null,null,null,null,null,null,"R26",{"$f":"(31/(AR274/10))","v":{"$error":"#DIV/0!"}}]
[null,null,null,null,null,null,null,null,null,null,null,null,null,null,null,null,null,null,null,null,null,null,"R27",{"$f":"(Z272/10/2)","v":2.5000000000000001E-3},null,null,null,null,null,null,null,null,null,null,null,null,null,null,null,null,"R27",{"$f":"(AR272/10/2)","v":2.5000000000000001E-3}]
[null,null,null,null,null,null,null,null,null,null,null,null,null,null,null,null,null,null,null,null,null,null,"R28",{"$f":"(Z272/10/2)","v":2.5000000000000001E-3},null,null,null,null,null,null,null,null,null,null,null,null,null,null,null,null,"R28",{"$f":"(AR272/10/2)","v":2.5000000000000001E-3}]
[null,null,null,null,null,null,null,null,null,null,null,null,null,null,null,null,null,null,null,null,null,null,"R29",{"$f":"(31/(Z274/10))","v":{"$error":"#DIV/0!"}},null,null,null,null,null,null,null,null,null,null,null,null,null,null,null,null,"R29",{"$f":"(31/(AR274/10))","v":{"$error":"#DIV/0!"}}]
[null,null,null,null,null,null,null,null,null,null,null,null,null,null,null,null,null,null,null,null,null,null,"R30",{"$f":"(Z272/10/2)","v":2.5000000000000001E-3},null,null,null,null,null,null,null,null,null,null,null,null,null,null,null,null,"R30",{"$f":"(AR272/10/2)","v":2.5000000000000001E-3}]
[]
[]
[null,null,null,null,null,null,null,null,null,null,null,null,null,null,null,null,null,null,null,null,null,null,null,"Kaapelin ominaisresistanssi",null,25,"ohm/km",null,null,null,null,null,null,null,null,null,null,null,null,null,null,"Kaapelin ominaisresistanssi",null,25,"ohm/km"]
[null,null,null,null,null,null,null,null,null,null,null,null,null,null,null,null,null,null,null,null,null,null,null,"Kaapelivastus/silmukka",null,{"$f":"((Z309*Z311)/1000)","v":2.5000000000000001E-2},"ohm",null,null,null,null,null,null,null,null,null,null,null,null,null,null,"Kaapelivastus/silmukka",null,{"$f":"((AR309*AR311)/1000)","v":2.5000000000000001E-2},"ohm"]
[null,null,null,null,null,null,null,null,null,null,null,null,null,null,null,null,null,null,null,null,null,null,null,"Kaapelin pituus",null,{"$f":"E148","v":1},"m",null,null,null,null,null,null,null,null,null,null,null,null,null,null,"Kaapelin pituus",null,{"$f":"F148","v":1},"m"]
[null,null,null,null,null,null,null,null,null,null,null,null,null,null,null,null,null,null,null,null,null,null,null,"Kuormitus",null,{"$f":"E150/1000","v":0},"A",null,null,null,null,null,null,null,null,null,null,null,null,null,null,"Kuormitus",null,{"$f":"(F150/1000)","v":0},"A"]
[]
[]
[null,null,null,null,null,null,null,null,null,null,null,null,null,null,null,null,null,null,null,null,null,null,"R1",{"$f":"(Z310/10/2)","v":1.25E-3},null,null,null,null,null,null,null,null,null,null,null,null,null,null,null,null,"R1",{"$f":"(AR310/10/2)","v":1.25E-3}]
[null,null,null,null,null,null,null,null,null,null,null,null,null,null,null,null,null,null,null,null,null,null,"R2",{"$f":"(31/(Z312/10))","v":{"$error":"#DIV/0!"}},null,{"$f":"(X315+X316+X317)","v":{"$error":"#DIV/0!"}},{"$f":"(-X316)","v":{"$error":"#DIV/0!"}},0,0,0,0,0,0,0,0,null,40,null,null,null,"R2",{"$f":"(31/(AR312/10))","v":{"$error":"#DIV/0!"}},null,{"$f":"(AP315+AP316+AP317)","v":{"$error":"#DIV/0!"}},{"$f":"(-AP316)","v":{"$error":"#DIV/0!"}},0,0,0,0,0,0,0,0,null,40]
[null,null,null,null,null,null,null,null,null,null,null,null,null,null,null,null,null,null,null,null,null,null,"R3",{"$f":"(Z310/10/2)","v":1.25E-3},null,{"$f":"(-X316)","v":{"$error":"#DIV/0!"}},{"$f":"(X318+X319+X320+X316)","v":{"$error":"#DIV/0!"}},{"$f":"(-X319)","v":{"$error":"#DIV/0!"}},0,0,0,0,0,0,0,null,0,null,null,null,"R3",{"$f":"(AR310/10/2)","v":1.25E-3},null,{"$f":"(-AP316)","v":{"$error":"#DIV/0!"}},{"$f":"(AP318+AP319+AP320+AP316)","v":{"$error":"#DIV/0!"}},{"$f":"(-AP319)","v":{"$error":"#DIV/0!"}},0,0,0,0,0,0,0,null,0]
[null,null,null,null,null,null,null,null,null,null,null,null,null,null,null,null,null,null,null,null,null,null,"R4",{"$f":"(Z310/10/2)","v":1.25E-3},null,0,{"$f":"(-X319)","v":{"$error":"#DIV/0!"}},{"$f":"(X321+X322+X323+X319)","v":{"$error":"#DIV/0!"}},{"$f":"(-X322)","v":{"$error":"#DIV/0!"}},0,0,0,0,0,0,null,0,null,null,null,"R4",{"$f":"(AR310/10/2)","v":1.25E-3},null,0,{"$f":"(-AP319)","v":{"$error":"#DIV/0!"}},{"$f":"(AP321+AP322+AP323+AP319)","v":{"$error":"#DIV/0!"}},{"$f":"(-AP322)","v":{"$error":"#DIV/0!"}},0,0,0,0,0,0,null,0]
[null,null,null,null,null,null,null,null,null,null,null,null,null,null,null,null,null,null,null,null,null,null,"R5",{"$f":"(31/(Z312/10))","v":{"$error":"#DIV/0!"}},null,0,0,{"$f":"(-X322)","v":{"$error":"#DIV/0!"}},{"$f":"(X324+X325+X326+X322)","v":{"$error":"#DIV/0!"}},{"$f":"(-X325)","v":{"$error":"#DIV/0!"}},0,0,0,0,0,null,0,null,null,null,"R5",{"$f":"(31/(AR312/10))","v":{"$error":"#DIV/0!"}},null,0,0,{"$f":"(-AP322)","v":{"$error":"#DIV/0!"}},{"$f":"(AP324+AP325+AP326+AP322)","v":{"$error":"#DIV/0!"}},{"$f":"(-AP325)","v":{"$error":"#DIV/0!"}},0,0,0,0,0,null,0]
[null,null,null,null,null,null,null,null,null,null,null,null,null,null,null,null,null,null,null,null,null,null,"R6",{"$f":"(Z310/10/2)","v":1.25E-3},null,0,0,0,{"$f":"(-X325)","v":{"$error":"#DIV/0!"}},{"$f":"(X327+X328+X329+X325)","v":{"$error":"#DIV/0!"}},{"$f":"(-X328)","v":{"$error":"#DIV/0!"}},0,0,0,0,null,0,null,null,null,"R6",{"$f":"(AR310/10/2)","v":1.25E-3},null,0,0,0,{"$f":"(-AP325)","v":{"$error":"#DIV/0!"}},{"$f":"(AP327+AP328+AP329+AP325)","v":{"$error":"#DIV/0!"}},{"$f":"(-AP328)","v":{"$error":"#DIV/0!"}},0,0,0,0,null,0]
[null,null,null,null,null,null,null,null,null,null,null,null,null,null,null,null,null,null,null,null,null,null,"R7",{"$f":"(Z310/10/2)","v":1.25E-3},null,0,0,0,0,{"$f":"(-X328)","v":{"$error":"#DIV/0!"}},{"$f":"(X330+X331+X332+X328)","v":{"$error":"#DIV/0!"}},{"$f":"(-X331)","v":{"$error":"#DIV/0!"}},0,0,0,null,0,null,null,null,"R7",{"$f":"(AR310/10/2)","v":1.25E-3},null,0,0,0,0,{"$f":"(-AP328)","v":{"$error":"#DIV/0!"}},{"$f":"(AP330+AP331+AP332+AP328)","v":{"$error":"#DIV/0!"}},{"$f":"(-AP331)","v":{"$error":"#DIV/0!"}},0,0,0,null,0]
[null,null,null,null,null,null,null,null,null,null,null,null,null,null,null,null,null,null,null,null,null,null,"R8",{"$f":"(31/(Z312/10))","v":{"$error":"#DIV/0!"}},null,0,0,0,0,0,{"$f":"(-X331)","v":{"$error":"#DIV/0!"}},{"$f":"(X330+X331+X332+X328)","v":{"$error":"#DIV/0!"}},{"$f":"(-X334)","v":{"$error":"#DIV/0!"}},0,0,null,0,null,null,null,"R8",{"$f":"(31/(AR312/10))","v":{"$error":"#DIV/0!"}},null,0,0,0,0,0,{"$f":"(-AP331)","v":{"$error":"#DIV/0!"}},{"$f":"(AP330+AP331+AP332+AP328)","v":{"$error":"#DIV/0!"}},{"$f":"(-AP334)","v":{"$error":"#DIV/0!"}},0,0,null,0]
[null,null,null,null,null,null,null,null,null,null,null,null,null,null,null,null,null,null,null,null,null,null,"R9",{"$f":"(Z310/10/2)","v":1.25E-3},null,0,0,0,0,0,0,{"$f":"(-X334)","v":{"$error":"#DIV/0!"}},{"$f":"(X336+X337+X338+X334)","v":{"$error":"#DIV/0!"}},{"$f":"(-X337)","v":{"$error":"#DIV/0!"}},0,null,0,null,null,null,"R9",{"$f":"(AR310/10/2)","v":1.25E-3},null,0,0,0,0,0,0,{"$f":"(-AP334)","v":{"$error":"#DIV/0!"}},{"$f":"(AP336+AP337+AP338+AP334)","v":{"$error":"#DIV/0!"}},{"$f":"(-AP337)","v":{"$error":"#DIV/0!"}},0,null,0]
[null,null,null,null,null,null,null,null,null,null,null,null,null,null,null,null,null,null,null,null,null,null,"R10",{"$f":"(Z310/10/2)","v":1.25E-3},null,0,0,0,0,0,0,0,{"$f":"(-X337)","v":{"$error":"#DIV/0!"}},{"$f":"(X339+X340+X341+X337)","v":{"$error":"#DIV/0!"}},{"$f":"(-X340)","v":{"$error":"#DIV/0!"}},null,0,null,null,null,"R10",{"$f":"(AR310/10/2)","v":1.25E-3},null,0,0,0,0,0,0,0,{"$f":"(-AP337)","v":{"$error":"#DIV/0!"}},{"$f":"(AP339+AP340+AP341+AP337)","v":{"$error":"#DIV/0!"}},{"$f":"(-AP340)","v":{"$error":"#DIV/0!"}},null,0]
[null,null,null,null,null,null,null,null,null,null,null,null,null,null,null,null,null,null,null,null,null,null,"R11",{"$f":"(31/(Z312/10))","v":{"$error":"#DIV/0!"}},null,0,0,0,0,0,0,0,0,{"$f":"(-X340)","v":{"$error":"#DIV/0!"}},{"$f":"(X342+X343+X344+X340)","v":{"$error":"#DIV/0!"}},null,0,null,null,null,"R11",{"$f":"(31/(AR312/10))","v":{"$error":"#DIV/0!"}},null,0,0,0,0,0,0,0,0,{"$f":"(-AP340)","v":{"$error":"#DIV/0!"}},{"$f":"(AP342+AP343+AP344+AP340)","v":{"$error":"#DIV/0!"}},null,0]
[null,null,null,null,null,null,null,null,null,null,null,null,null,null,null,null,null,null,null,null,null,null,"R12",{"$f":"(Z310/10/2)","v":1.25E-3},null,null,null,null,null,null,null,null,null,null,null,null,null,null,null,null,"R12",{"$f":"(AR310/10/2)","v":1.25E-3}]
[null,null,null,null,null,null,null,null,null,null,null,null,null,null,null,null,null,null,null,null,null,null,"R13",{"$f":"(Z310/10/2)","v":1.25E-3},null,null,null,null,null,null,null,null,null,null,null,null,null,null,null,null,"R13",{"$f":"(AR310/10/2)","v":1.25E-3}]
[null,null,null,null,null,null,null,null,null,null,null,null,null,null,null,null,null,null,null,null,null,null,"R14",{"$f":"(31/(Z312/10))","v":{"$error":"#DIV/0!"}},null,{"$f":"MINVERSE(Z316:AI325)","v":{"$error":"#DIV/0!"}},null,null,null,null,null,null,null,null,null,null,{"$f":"MMULT(_xlfn.ANCHORARRAY(Z328),AK316:AK325)","v":{"$error":"#DIV/0!"}},null,null,null,"R14",{"$f":"(31/(AR312/10))","v":{"$error":"#DIV/0!"}},null,{"$f":"MINVERSE(AR316:BA325)","v":{"$error":"#DIV/0!"}},null,null,null,null,null,null,null,null,null,null,{"$f":"MMULT(_xlfn.ANCHORARRAY(AR328),BC316:BC325)","v":{"$error":"#DIV/0!"}}]
[null,null,null,null,null,null,null,null,null,null,null,null,null,null,null,null,null,null,null,null,null,null,"R15",{"$f":"(Z310/10/2)","v":1.25E-3},null,null,null,null,null,null,null,null,null,null,null,null,null,null,null,null,"R15",{"$f":"(AR310/10/2)","v":1.25E-3}]
[null,null,null,null,null,null,null,null,null,null,null,null,null,null,null,null,null,null,null,null,null,null,"R16",{"$f":"(Z310/10/2)","v":1.25E-3},null,null,null,null,null,null,null,null,null,null,null,null,null,null,null,null,"R16",{"$f":"(AR310/10/2)","v":1.25E-3}]
[null,null,null,null,null,null,null,null,null,null,null,null,null,null,null,null,null,null,null,null,null,null,"R17",{"$f":"(31/(Z312/10))","v":{"$error":"#DIV/0!"}},null,null,null,null,null,null,null,null,null,null,null,null,null,null,null,null,"R17",{"$f":"(31/(AR312/10))","v":{"$error":"#DIV/0!"}}]
[null,null,null,null,null,null,null,null,null,null,null,null,null,null,null,null,null,null,null,null,null,null,"R18",{"$f":"(Z310/10/2)","v":1.25E-3},null,null,null,null,null,null,null,null,null,null,null,null,null,null,null,null,"R18",{"$f":"(AR310/10/2)","v":1.25E-3}]
[null,null,null,null,null,null,null,null,null,null,null,null,null,null,null,null,null,null,null,null,null,null,"R19",{"$f":"(Z310/10/2)","v":1.25E-3},null,null,null,null,null,null,null,null,null,null,null,null,null,null,null,null,"R19",{"$f":"(AR310/10/2)","v":1.25E-3}]
[null,null,null,null,null,null,null,null,null,null,null,null,null,null,null,null,null,null,null,null,null,null,"R20",{"$f":"(31/(Z312/10))","v":{"$error":"#DIV/0!"}},null,null,null,null,null,null,null,null,null,null,null,null,null,null,null,null,"R20",{"$f":"(31/(AR312/10))","v":{"$error":"#DIV/0!"}}]
[null,null,null,null,null,null,null,null,null,null,null,null,null,null,null,null,null,null,null,null,null,null,"R21",{"$f":"(Z310/10/2)","v":1.25E-3},null,null,null,null,null,null,null,null,null,null,null,null,null,null,null,null,"R21",{"$f":"(AR310/10/2)","v":1.25E-3}]
[null,null,null,null,null,null,null,null,null,null,null,null,null,null,null,null,null,null,null,null,null,null,"R22",{"$f":"(Z310/10/2)","v":1.25E-3},null,null,null,null,null,null,null,null,null,null,null,null,null,null,null,null,"R22",{"$f":"(AR310/10/2)","v":1.25E-3}]
[null,null,null,null,null,null,null,null,null,null,null,null,null,null,null,null,null,null,null,null,null,null,"R23",{"$f":"(31/(Z312/10))","v":{"$error":"#DIV/0!"}},null,null,null,null,null,null,null,null,null,null,null,null,null,null,null,null,"R23",{"$f":"(31/(AR312/10))","v":{"$error":"#DIV/0!"}}]
[null,null,null,null,null,null,null,null,null,null,null,null,null,null,null,null,null,null,null,null,null,null,"R24",{"$f":"(Z310/10/2)","v":1.25E-3},null,null,null,null,null,null,null,null,null,null,null,null,null,null,null,null,"R24",{"$f":"(AR310/10/2)","v":1.25E-3}]
[null,null,null,null,null,null,null,null,null,null,null,null,null,null,null,null,null,null,null,null,null,null,"R25",{"$f":"(Z310/10/2)","v":1.25E-3},null,null,null,null,null,null,null,null,null,null,null,null,null,"UR30",{"$f":"(X343*AK337)","v":{"$error":"#DIV/0!"}},null,"R25",{"$f":"(AR310/10/2)","v":1.25E-3},null,null,null,null,null,null,null,null,null,null,null,null,null,"UR30",{"$f":"(AP343*BC337)","v":{"$error":"#DIV/0!"}}]
[null,null,null,null,null,null,null,null,null,null,null,null,null,null,null,null,null,null,null,null,null,null,"R26",{"$f":"(31/(Z312/10))","v":{"$error":"#DIV/0!"}},null,null,null,null,null,null,null,null,null,null,null,null,null,null,null,null,"R26",{"$f":"(31/(AR312/10))","v":{"$error":"#DIV/0!"}}]
[null,null,null,null,null,null,null,null,null,null,null,null,null,null,null,null,null,null,null,null,null,null,"R27",{"$f":"(Z310/10/2)","v":1.25E-3},null,null,null,null,null,null,null,null,null,null,null,null,null,null,null,null,"R27",{"$f":"(AR310/10/2)","v":1.25E-3}]
[null,null,null,null,null,null,null,null,null,null,null,null,null,null,null,null,null,null,null,null,null,null,"R28",{"$f":"(Z310/10/2)","v":1.25E-3},null,null,null,null,null,null,null,null,null,null,null,null,null,null,null,null,"R28",{"$f":"(AR310/10/2)","v":1.25E-3}]
[null,null,null,null,null,null,null,null,null,null,null,null,null,null,null,null,null,null,null,null,null,null,"R29",{"$f":"(31/(Z312/10))","v":{"$error":"#DIV/0!"}},null,null,null,null,null,null,null,null,null,null,null,null,null,null,null,null,"R29",{"$f":"(31/(AR312/10))","v":{"$error":"#DIV/0!"}}]
[null,null,null,null,null,null,null,null,null,null,null,null,null,null,null,null,null,null,null,null,null,null,"R30",{"$f":"(Z310/10/2)","v":1.25E-3},null,null,null,null,null,null,null,null,null,null,null,null,null,null,null,null,"R30",{"$f":"(AR310/10/2)","v":1.25E-3}]

{"sheet":"Neptolux FIN","index":1,"n_rows":344,"n_cols":57,"rows_kept":344,"cut":false,"hidden":false,"merged":[[14,4,14,5],[14,6,14,7],[26,9,27,16],[28,9,29,16],[30,9,31,16],[7,9,7,11],[0,9,0,11],[2,9,2,11],[4,9,4,11],[6,9,6,11],[1,9,1,11],[3,9,3,11],[5,9,5,11]]}
["Kaapelimitoitus ja kuormitus",null,null,null,null,null,null,null,"Kohde:"]
["v 1.1"]
["Nepto 3K",null,null,null,null,null,null,null,"Pvm:"]
[null,"Lepo",null,null,"Määrä","Kulutus, mA"]
["Nepto 3K",60,null,null,1,{"$f":"E5*B5","v":60},null,null,"Versio:"]
["Linjakortti (linja 2)",15,null,null,0,{"$f":"E6*B6","v":0}]
["Verkotuskortti (HedRing.net)",40,null,null,0,0,null,null,"Numero:"]
["NL-KLG",60,null,null,0,0]
[]
["Yhteensä:",null,null,null,null,{"$f":"SUM(F5:F9)","v":60}]
[]
[]
[null,null,null,null,null,null,null,null,null,null,null,null,null,null,null,null,null,null,"Maksimikuormituksen laskenta"]
[]
["Turvavalot","Lepo","Lataus/vikaledi",null,"Linja 1",null,"Linja 2",null,null,"Käyttöohje",null,null,null,null,null,null,null,null,"Neptolux- laitteet",null,null,null,"Linja 1",null,null,null,"Linja 2"]
[null,null,"päällä",null,"Määrä","Virta, mA","Määrä","Virta, mA",null,null,null,null,null,null,null,null,null,null,null,"I, [mA]","NU","P, [W]","Määrä","NU","Teho, W","Virta, mA","Määrä","NU","Teho, W","Virta, mA"]
["N68-C/ N68-O (0) TEHDASAS.",7.8,0.4,null,0,{"$f":"(B17*E17)","v":0},0,{"$f":"(B17*G17)","v":0},null,"Tämän laskurin avulla määritetään:",null,null,null,null,null,null,null,null,"N68-C/N68-O 24h, Normaaliteho",{"$f":"B17","v":7.8},4.8,0.04,{"$f":"(E17-W18-W19-W20)","v":0},{"$f":"(W17*U17)","v":0},{"$f":"(W17*0.25)","v":0},{"$f":"(W17*T17)","v":0},{"$f":"(G17-AA18-AA19-AA20)","v":0},{"$f":"(AA17*Y17)","v":0},{"$f":"(AA17*0.25)","v":0},{"$f":"(AA17*T17)","v":0}]
["N68-C/ N68-O (1)",11.04,0.4,null,0,{"$f":"(B18*E18)","v":0},0,0,null,"Nepto 3K- keskuksen virrankulutus",null,null,null,null,null,null,null,null,"N68-C/N68-O 12h, Normaaliteho",{"$f":"(T17+4.7)","v":12.5},{"$f":"(U17+2)","v":6.8},0.96,0,{"$f":"(W18*U18)","v":0},0,0,0,{"$f":"(AA18*Y18)","v":0},0,{"$f":"(AA18*T18)","v":0}]
["N68-C/ N68-O (2)",14.280000000000001,0.4,null,0,0,0,0,null,"Linjan kuormitus",null,null,null,null,null,null,null,null,"N68-C/N68-O 24h, Hi-Power",{"$f":"(T17+4.7)","v":12.5},{"$f":"(U17+2)","v":6.8},0.04,0,0,{"$f":"(W19*0.25)","v":0},0,0,0,{"$f":"(AA19*0.25)","v":0},{"$f":"(AA19*T19)","v":0}]
["N68-C/ N68-O (3)",17.52,0.4,null,0,0,0,0,null,"Linjan maksimipituus",null,null,null,null,null,null,null,null,"N68-C/N68-O 12h, Hi-Power",{"$f":"(T17+21.7)","v":29.5},{"$f":"(U17+13)","v":17.8},0.96,0,0,{"$f":"(W20*0.25)","v":0},0,0,0,{"$f":"(AA20*0.25)","v":0},0]
["N68-C/ N68-O (4)",24,0.4,null,0,0,0,0,null,"Keskusakuston mitoitus",null,null,null,null,null,null,null,null,"N20 24h, Normaaliteho",{"$f":"B29","v":12.7},7.9,0.25,{"$f":"(E29-W22)","v":0},0,{"$f":"(W21*0.25)","v":0},0,{"$f":"(G29-AA22)","v":0},0,{"$f":"(AA21*0.25)","v":0},0]
["N68-C/ N68-O (5)",30.48,0.4,null,0,0,0,0,null,null,null,null,null,null,null,null,null,null,"N20 12h, Normaaliteho",{"$f":"(T21+4.7)","v":17.399999999999999},{"$f":"(U21+2)","v":9.9},0.25,0,0,{"$f":"(W22*0.25)","v":0},0,0,0,{"$f":"(AA22*0.25)","v":0},0]
["N68-C/ N68-O (6)",36.311999999999998,0.4,null,0,0,0,0,null,"1. Syötä keskuslaitteiden määrä",null,null,null,null,null,null,null,null,"N40 24h, Normaaliteho",{"$f":"B37","v":20.399999999999999},12.6,0.53,{"$f":"(E37-W24)","v":0},0,{"$f":"(W23*0.53)","v":0},0,{"$f":"(G37-AA24)","v":0},0,{"$f":"(AA23*0.53)","v":0},0]
["N68-C/ N68-O (7) AKTIIVITILA",36.311999999999998,0.4,null,0,0,0,0,null,"2. Syötä linjoissa käytettävät valaisinmäärät tyypeittäin. Oletuskirkkaudet on merkitty taulukkoon tummemmalla sävyllä",null,null,null,null,null,null,null,null,"N40 12h, Normaaliteho",{"$f":"(T23+4.7)","v":25.099999999999998},{"$f":"(U23+2)","v":14.6},0.53,0,0,{"$f":"(W24*0.53)","v":0},0,0,0,{"$f":"(AA24*0.53)","v":0},0]
["N20 / N20-X (0)",6.1,0.4,null,0,0,0,0,null,"3. Laskuri ilmoittaa, mikäli maksimikuormitus tai osoitemäärä ylittyy",null,null,null,null,null,null,null,null,"N68-C-3/N68-O-3 24h, Normaaliteho",{"$f":"B41","v":22},13.6,0.04,{"$f":"(E41-W26-W27-W28)","v":0},0,{"$f":"(W25*0.25)","v":0},0,{"$f":"(G41-AA26-AA27-AA28)","v":0},0,{"$f":"(AA25*0.25)","v":0},0]
["N20 / N20-X (1)",7.333333333333333,0.4,null,0,0,0,0,null,"4. Syötä linjan arvioitu maksimipituus rivillä 148 oleviin kenttiin. (etäisyys keskukselta kauimmaiselle valaisimelle)",null,null,null,null,null,null,null,null,"N68-C-3/N68-O-3 12h, Normaaliteho",{"$f":"(T25+17.1)","v":39.1},{"$f":"(U25+11)","v":24.6},0.96,0,0,0,0,0,0,0,0]
["N20 / N20-X (2)",8.5666666666666664,0.4,null,0,0,0,0,null,"5. Laskuri käyttää kohdassa 2 syötettyjä virta-arvoja ja ilmoittaa kaapelityypeittäin, onko kaapelin kuormitus sopivissa rajoissa",null,null,null,null,null,null,null,null,"N68-C-3/N68-O-3 24h, Hi-Power",{"$f":"(T25+4.7)","v":26.7},{"$f":"(U25+11)","v":24.6},0.04,0,0,0,0,0,0,0,0]
["N20 / N20-X (3)",9.8000000000000007,0.4,null,0,0,0,0,null,null,null,null,null,null,null,null,null,null,"N68-C-3/N68-O-3 12h, Hi-Power",{"$f":"(T25+24.1)","v":46.1},{"$f":"(U25+15)","v":28.6},0.96,0,0,0,0,0,0,0,0]
["N20 / N20-X (4) TEHDASAS.",12.7,0.4,null,0,0,0,0,null,"6. Järjestelmässä on mahdollista käyttää HI-Power- asetusta tai 12h latausta, jolloin linjan lautauksenaikainen maksimikuormitus kasvaa.",null,null,null,null,null,null,null,null,"N20-3 24h, Normaaliteho",{"$f":"B53","v":20.6},12.8,0.25,{"$f":"(E53-W30)","v":0},0,0,{"$f":"(W29*T29)","v":0},{"$f":"(G53-AA30)","v":0},0,0,0]
["N20 / N20-X (5)",15.350000000000001,0.4,null,0,0,0,0,null,null,null,null,null,null,null,null,null,null,"N20-3 12h, Normaaliteho",{"$f":"(T29+17.1)","v":37.700000000000003},{"$f":"(U29+11)","v":23.8},0.25,0,0,0,{"$f":"(W30*T30)","v":0},0,0,0,0]
["N20 / N20-X (6)",18.100000000000001,0.4,null,0,0,0,0,null,"Käytä tarvittaessa oikealla puolella olevaa aputaulukkoa määrittämään latauksenaikainen maksimikuormitus. Laskuri ottaa syötetyt arvot huomioon kaapelimitoituksessa. (aktiiviset kentät on merkitty tummemmalla sävyllä)",null,null,null,null,null,null,null,null,"N40-3 24h, Normaaliteho",{"$f":"B61","v":28.106666666666662},19.3,0.53,{"$f":"(E61-W32)","v":0},0,0,0,{"$f":"(G53-AA32)","v":0},0,0,0]
["N20 / N20-X (7)",12.7,0.4,null,0,0,0,0,null,null,null,null,null,null,null,null,null,null,"N40-3 12h, Normaaliteho",{"$f":"(T31+17.1)","v":45.206666666666663},{"$f":"(U31+11)","v":30.3},0.53,0,0,0,{"$f":"(W32*T32)","v":0},0,0,0,0]
["N40 / N40-X (0)",6.1,0.4,null,0,0,0,0,null,null,null,null,null,null,null,null,null,null,"N55 24h, Normaaliteho",{"$f":"B81","v":6.1},3.8,0.04,{"$f":"(E81-W34-W35-W36)","v":0},0,0,0,{"$f":"(G81-AA34-AA35-AA36)","v":0},0,0,0]
["N40 / N40-X (1)",8.3879999999999999,0.4,null,0,0,0,0,null,"Keskusakusto",null,null,null,null,null,null,null,null,"N55 12h, Normaaliteho",9.6999999999999993,{"$f":"(U33+2)","v":5.8},0.96,0,0,0,{"$f":"(W34*T34)","v":0},0,0,0,0]
["N40 / N40-X (2)",11.82,0.4,null,0,0,0,0,null,"1. Keskusakustojärjestelmän kaapelikuormitusta määrittäessä käytetään valaisinten aktiivitilan kuormitusta vastaavia arvoja",null,null,null,null,null,null,null,null,"N55 24h, Hi-Power",13.8,{"$f":"(U33+2)","v":5.8},0.04,0,0,0,{"$f":"(W35*T35)","v":0},0,0,0,0]
["N40 / N40-X (3)",15.251999999999999,0.4,null,0,0,0,0,null,"2. Merkitse linjalla olevien turva- ja opastevalojen määrät \"AKTIIVITILA\"- riville. Opastevaloilla = \"TEHDASASETUS\"",null,null,null,null,null,null,null,null,"N55 12h, Hi-Power",32,{"$f":"(U33+13)","v":16.8},0.96,0,0,0,{"$f":"(W36*T36)","v":0},0,0,0,0]
["N40 / N40-X (4) TEHDASAS.",20.399999999999999,0.4,null,0,0,0,0,null,"3. Keskusakustokäyttöä varten on määritettävä akuston riittävä toiminta-aika",null,null,null,null,null,null,null,null,"N55-3 24h, Normaaliteho",{"$f":"B89","v":9.6999999999999993},6,0.04,{"$f":"(E89-W38-W39-W40)","v":0},0,0,0,{"$f":"(G89-AA38-AA39-AA40)","v":0},0,0,0]
["N40 / N40-X (5)",23.259999999999998,0.4,null,0,0,0,0,null,"4. Syötä akkulaskuriiin haluttu \"varakäyntiaika\" sekä \"valittu akkukoko\"",null,null,null,null,null,null,null,null,"N55-3 12h, Normaaliteho",28.3,{"$f":"(U37+11)","v":17},0.96,0,0,0,{"$f":"(W38*T38)","v":0},0,0,0,0]
["N40 / N40-X (6)",26.119999999999997,0.4,null,0,0,0,0,null,"5. Laskuri ilmoittaa, onko akkumitoitus riittävä",null,null,null,null,null,null,null,null,"N55-3 24h, Hi-Power",13.8,{"$f":"(U37+11)","v":17},0.04,0,0,0,{"$f":"(W39*T39)","v":0},0,0,0,0]
["N40 / N40-X (7)",20.399999999999999,0.4,null,0,0,0,0,null,null,null,null,null,null,null,null,null,null,"N55-3 12h, Hi-Power",32,{"$f":"(U37+15)","v":21},0.96,0,0,0,{"$f":"(W40*T40)","v":0},0,0,0,0]
["N68-C3/ N68-O3 (0) TEHDASAS.",22,0.4,null,0,0,0,0,null,null,null,null,null,null,null,null,null,null,"N89-C/N89-O 24h, Normaaliteho",{"$f":"B97","v":16.5},10.199999999999999,0.08,{"$f":"(E97-W42)","v":0},0,0,0,{"$f":"(G97-AA42)","v":0},0,0,0]
["N68-C3/ N68-O3 (1)",25.24,0.4,null,0,0,0,0,null,null,null,null,null,null,null,null,null,null,"N89-C/N89-O 12h, Normaaliteho",{"$f":"(T41+11)","v":27.5},{"$f":"(U41+6.5)","v":16.7},6.82,0,0,0,{"$f":"(W42*T42)","v":0},0,0,0,0]
["N68-C3/ N68-O3 (2)",28.48,0.4,null,0,0,0,0,null,null,null,null,null,null,null,null,null,null,"N89-C-3/N89-O-3 24h, Normaaliteho",44.5,27.6,0.08,{"$f":"(E105-W44)","v":0},0,0,0,{"$f":"(G105-AA44)","v":0},0,0,0]
["N68-C3/ N68-O3 (3)",31.72,0.4,null,0,0,0,0,null,null,null,null,null,null,null,null,null,null,"N89-C-3/N89-O-3 12h, Normaaliteho",{"$f":"(T43+36)","v":80.5},{"$f":"(U43+22.5)","v":50.1},6.82,0,0,0,{"$f":"(W44*T44)","v":0},0,0,0,0]
["N68-C3/ N68-O3 (4)",38.200000000000003,0.4,null,0,0,0,0,null,null,null,null,null,null,null,null,null,null,"N40C 24h, Normaaliteho",{"$f":"B117","v":50.5},31.3,0.08,{"$f":"(E117-W46)","v":0},0,0,0,{"$f":"(G117-AA46)","v":0},0,0,0]
["N68-C3/ N68-O3 (5)",44.68,0.4,null,0,0,0,0,null,null,null,null,null,null,null,null,null,null,"N40C 12h, Normaaliteho",{"$f":"(T45+11)","v":61.5},{"$f":"(U45+6.5)","v":37.799999999999997},6.82,0,0,0,{"$f":"(W46*T46)","v":0},0,0,0,0]
["N68-C3/ N68-O3 (6)",50.512,0.4,null,0,0,0,0,null,null,null,null,null,null,null,null,null,null,"N40C-3 24h, Normaaliteho",78.5,{"$f":"(31.3+6.8)","v":38.1},0.08,{"$f":"(E125-W48)","v":0},0,0,0,{"$f":"(G125-AA48)","v":0},0,0,0]
["N68-C3/ N68-O3 (7) AKTIIVITILA",50.512,0.4,null,0,0,0,0,null,null,null,null,null,null,null,null,null,null,"N40C-3 12h, Normaaliteho",{"$f":"(78.5+36)","v":114.5},{"$f":"(48.7+22.5)","v":71.2},6.82,0,0,0,0,0,0,0,0]
["N20-3 / N20-X3 (0)",13.8,0.4,null,0,0,0,{"$f":"(B49*G49)","v":0},null,null,null,null,null,null,null,null,null,null,"N70 24h, Normaaliteho",{"$f":"B69","v":50.5},31.3,0.08,{"$f":"(E69-W50)","v":0},0,0,{"$f":"(W49*T49)","v":0},{"$f":"(G69-AA50)","v":0},0,0,0]
["N20-3 / N20-X3 (1)",15,0.4,null,0,0,0,0,null,null,null,null,null,null,null,null,null,null,"N70 12h, Normaaliteho",{"$f":"(50.5+11)","v":61.5},{"$f":"(31.3+6.8)","v":38.1},0.92,0,0,0,{"$f":"(W50*T50)","v":0},0,0,0,0]
["N20-3 / N20-X3 (2)",16.3,0.4,null,0,0,0,0,null,null,null,null,null,null,null,null,null,null,"N70-3 24h, Normaaliteho",{"$f":"B77","v":78.5},48.7,0.08,{"$f":"(E77-W52)","v":0},0,0,{"$f":"(W51*T51)","v":0},{"$f":"(G77-AA52)","v":0},0,0,0]
["N20-3 / N20-X3 (3)",17.5,0.4,null,0,0,0,0,null,null,null,null,null,null,null,null,null,null,"N70-3 12h, Normaaliteho",{"$f":"(78.5+36)","v":114.5},{"$f":"(48.7+22.5)","v":71.2},0.92,0,0,0,{"$f":"(W52*T52)","v":0},0,0,0,0]
["N20-3 / N20-X3 (4) TEHDASAS.",20.6,0.4,null,0,0,0,0,null,null,null,null,null,null,null,null,null,null,"N-IO",{"$f":"B129","v":3.2},2,0.1,{"$f":"(W5)","v":0},0,0,0,{"$f":"(AA5)","v":0},0,0,{"$f":"(AA53*T53)","v":0}]
["N20-3 / N20-X3 (5)",23.1,0.4,null,0,0,0,0,null,null,null,null,null,null,null,null,null,null,null,null,null,null,"Max. 127",null,null,"Max. 2000","Max. 127",null,null,"Max. 2000"]
["N20-3 / N20-X3 (6)",26.1,0.4,null,0,0,0,0,null,null,null,null,null,null,null,null,null,null,"Yhteensä:",null,null,null,{"$f":"SUM(W17:W53)","v":0},{"$f":"SUM(X17:X53)","v":0},{"$f":"SUM(Y17:Y53)","v":0},{"$f":"SUM(Z17:Z54)","v":0},{"$f":"SUM(AA17:AA53)","v":0},{"$f":"SUM(AB17:AB53)","v":0},{"$f":"SUM(AC17:AC53)","v":0},{"$f":"SUM(AD17:AD53)","v":0}]
["N20-3 / N20-X3 (7)",20.6,0.4,null,0,0,0,0,null,null,null,null,null,null,null,null,null,null,null,null,null,null,{"$f":"(W55/127)","v":0},null,null,{"$f":"(Z55/2000)","v":0},{"$f":"(AA55/127)","v":0},null,null,{"$f":"(AD55/2000)","v":0}]
["N40-3 / N40-X3 (0)",13.806666666666665,0.4,null,0,0,0,0]
["N40-3 / N40-X3 (1)",16.094666666666665,0.4,null,0,0,0,0]
["N40-3 / N40-X3 (2)",19.526666666666664,0.4,null,0,0,0,0]
["N40-3 / N40-X3 (3)",22.958666666666666,0.4,null,0,0,0,0]
["N40-3 / N40-X3 (4) TEHDASAS.",28.106666666666662,0.4,null,0,0,0,0]
["N40-3 / N40-X3 (5)",30.966666666666661,0.4,null,0,0,0,0]
["N40-3 / N40-X3 (6)",33.826666666666661,0.4,null,0,0,0,0]
["N40-3 / N40-X3 (7)",28.106666666666662,0.4,null,0,0,0,0]
["N70 / N70-X (0)",16.5,0.4,null,0,0,0,0]
["N70 / N70-X (1)",23.3,0.4,null,0,0,0,0]
["N70 / N70-X (2)",30.1,0.4,null,0,0,0,0]
["N70 / N70-X (3)",36.9,0.4,null,0,0,0,0]
["N70 / N70-X (4) TEHDASASETUS",50.5,0.4,null,0,0,0,0]
["N70 / N70-X (5)",57.3,0.4,null,0,0,0,0]
["N70 / N70-X (6)",70.900000000000006,0.4,null,0,0,0,0]
["N70 / N70-X (7)",43.7,0.4,null,0,0,0,0]
["N70-3 / N70-X-3 (0)",44.5,0.4,null,0,0,0,{"$f":"(B73*G73)","v":0}]
["N70-3 / N70-X-3 (1)",51.3,0.4,null,0,0,0,0]
["N70-3 / N70-X-3 (2)",58.1,0.4,null,0,0,0,0]
["N70-3 / N70-X-3 (3)",64.900000000000006,0.4,null,0,0,0,0]
["N70-3 / N70-X-3 (4) TEHDASASETUS",78.5,0.4,null,0,0,0,0]
["N70-3 / N70-X-3 (5)",85.3,0.4,null,0,0,0,0]
["N70-3 / N70-X-3 (6)",98.9,0.4,null,0,0,0,0]
["N70-3 / N70-X-3 (7)",71.7,0.4,null,0,0,0,0]
["N55 (0) TEHDASASETUS",6.1,0.4,null,0,0,0,{"$f":"(B81*G81)","v":0}]
["N55 (1)",9.5,0.4,null,0,0,0,0]
["N55 (2)",12.9,0.4,null,0,0,0,0]
["N55 (3)",16.2,0.4,null,0,0,0,0]
["N55 (4)",23,0.4,null,0,0,0,0]
["N55 (5)",29.8,0.4,null,0,0,0,0]
["N55 (6)",35.799999999999997,0.4,null,0,0,0,0]
["N55 (7) AKTIIVITILA",35.799999999999997,0.4,null,0,0,0,0]
["N55-3 (0) TEHDASASETUS",9.6999999999999993,0.4,null,0,0,0,0]
["N55-3 (1)",13.1,0.4,null,0,0,0,0]
["N55-3 (2)",16.5,0.4,null,0,0,0,0]
["N55-3 (3)",19.8,0.4,null,0,0,0,0]
["N55-3 (4)",26.6,0.4,null,0,0,0,0]
["N55-3 (5)",33.4,0.4,null,0,0,0,0]
["N55-3 (6)",39.5,0.4,null,0,0,0,0]
["N55-3 (7) AKTIIVITILA",39.5,0.4,null,0,0,0,0]
["N89-C/N89-O (0) TEHDASASETUS",16.5,0.4,null,0,0,0,0]
["N89-C/N89-O (1)",30.1,0.4,null,0,{"$f":"(B98*E98)","v":0},0,0]
["N89-C/N89-O (2)",36.9,0.4,null,0,0,0,0]
["N89-C/N89-O (3)",43.7,0.4,null,0,0,0,0]
["N89-C/N89-O (4)",50.5,0.4,null,0,0,0,0]
["N89-C/N89-O (5)",64.099999999999994,0.4,null,0,0,0,0]
["N89-C/N89-O (6) AKTIIVITILA",152.5,0.4,null,0,0,0,0]
["N89-C/N89-O (7)",234.1,0.4,null,0,0,0,0]
["N89-C3/N89-O3 (0) TEHDASASETUS",44.5,0.4,null,0,0,0,0]
["N89-C3/N89-O3 (1)",58.1,0.4,null,0,0,0,0]
["N89-C3/N89-O3 (2)",64.900000000000006,0.4,null,0,0,0,0]
["N89-C3/N89-O3 (3)",71.7,0.4,null,0,0,0,0]
["N89-C3/N89-O3 (4)",78.5,0.4,null,0,0,0,0]
["N89-C3/N89-O3 (5)",92.1,0.4,null,0,0,0,0]
["N89-C3/N89-O3 (6) AKTIIVITILA",180.5,0.4,null,0,0,0,0]
["N89-C3/N89-O3 (7)",262.10000000000002,0.4,null,0,0,0,0]
["N40C/N40C (0)",16.5,0.4,null,0,0,0,{"$f":"(B113*G113)","v":0}]
["N40C/N40C (1)",30.1,0.4,null,0,{"$f":"(B114*E114)","v":0},0,0]
["N40C/N40C (2)",36.9,0.4,null,0,0,0,0]
["N40C/N40C (3)",43.7,0.4,null,0,0,0,0]
["N40C/N40C (4) TEHDASASETUS",50.5,0.4,null,0,0,0,0]
["N40C/N40C (5)",64.099999999999994,0.4,null,0,0,0,0]
["N40C/N40C (6)",70.900000000000006,0.4,null,0,0,0,0]
["N40C/N40C (7) AKTIIVITILA",234.1,0.4,null,0,0,0,0]
["N40C-3/N40C-3 (0)",44.5,0.4,null,0,0,0,0]
["N40C-3/N40C-3 (1)",58.1,0.4,null,0,0,0,0]
["N40C-3/N40C-3 (2)",64.900000000000006,0.4,null,0,0,0,0]
["N40C-3/N40C-3 (3)",71.7,0.4,null,0,0,0,0]
["N40C-3/N40C-3 (4) TEHDASASETUS",78.5,0.4,null,0,0,0,0]
["N40C-3/N40C-3 (5)",92.1,0.4,null,0,0,0,0]
["N40C-3/N40C-3 (6)",98.9,0.4,null,0,0,0,0]
["N40C-3/N40C-3 (7) AKTIIVITILA",262.10000000000002,0.4,null,0,0,0,0]
["N-IO",3.2,null,null,0,{"$f":"(B129*E129)","v":0},0,0]
[]
[null,null,null,null,"Määrä","Määrä","Määrä","Määrä"]
["Yhteensä:",null,null,null,{"$f":"SUM(E17:E129)","v":0},{"$f":"SUM(F17:F129)","v":0},{"$f":"SUM(G17:G129)","v":0},{"$f":"SUM(H17:H129)","v":0}]
[null,null,null,null,{"$f":"IF(E132<128,\"Ok\",\"Virhe\")","v":"Ok"},{"$f":"IF(F132<2000,\"Ok\",\"Virhe\")","v":"Ok"},{"$f":"IF(G132<128,\"Ok\",\"Virhe\")","v":"Ok"},{"$f":"IF(H132<2000,\"Ok\",\"Virhe\")","v":"Ok"},null,"Keskusakuston mitoitus"]
[null,null,null,null,null,null,null,null,null,"Tarvittava akkukoko",null,null,{"$f":"((F143*M136*2)/1000)","v":0.12},"Ah"]
["Kulutus",null,null,null,"Määrä","Virta",null,"Max. kuorma"]
[null,null,null,null,"kpl","(mA)",null,"Lataus (mA)",null,"Varakäyntiaika",null,null,1,"tuntia"]
["Keskus:",null,null,null,null,{"$f":"F10","v":60},null,"-"]
["Linja 1",null,null,null,{"$f":"E132","v":0},{"$f":"(F132)","v":0},null,{"$f":"(Z55)","v":0}]
["Linja 2",null,null,null,{"$f":"G132","v":0},{"$f":"H132","v":0},null,{"$f":"(AD55)","v":0},null,"Valittu akkukoko",null,{"$f":"IF(M139>M134,\"OK\",\"Ei voida ladata\")","v":"OK"},20,"Ah"]
[]
[null,null,null,null,null,null,null,null,null,"Toteutuva varakäyntiaika",null,null,{"$f":"(M139*1000)/(F143*2)","v":166.66666666666666},"h"]
[null,null,null,null,"kpl","(mA)"]
["Yhteensä:",null,null,null,{"$f":"SUM(E138:E142)","v":0},{"$f":"SUM(F137:F142)","v":60}]
[]
[]
[]
[null,null,null,null,"Linja 1","Linja 2"]
["Väylän pituus [m] (max. 1000m)",null,null,null,1,1]
[null,null,null,null,{"$f":"IF(E148<=1000,\"OK\",\"TOO LONG\")","v":"OK"},{"$f":"IF(F148<=1000,\"OK\",\"TOO LONG\")","v":"OK"}]
["Max virta [mA]",null,null,null,{"$f":"IF(F138<H138,H138,F138)","v":0},{"$f":"IF(F139<H139,H139,F139)","v":0}]
[null,null,0.7,"yF"]
[null,null,0.7,"mH"]
[]
[]
["Osoitteet silmukassa tasavälein"]
["KLMA 2x0.8 74 ohm / km",null,null,null,{"$f":"IF(LOOKUP(E148,#REF!,#REF!)>E150,\"OK\",\"EI OK\")","v":{"$error":"#REF!"}},{"$f":"IF(LOOKUP(F148,#REF!,#REF!)>F150,\"OK\",\"EI OK\")","v":{"$error":"#REF!"}},{"$f":"IF(LOOKUP(G148,#REF!,#REF!)>G150,\"OK\",\"EI OK\")","v":{"$error":"#REF!"}},{"$f":"IF(LOOKUP(H148,#REF!,#REF!)>H150,\"OK\",\"EI OK\")","v":{"$error":"#REF!"}}]
["KLMA 4x0.8 37 ohm / km",null,null,null,{"$f":"IF(LOOKUP(E148,#REF!,#REF!)>E150,\"OK\",\"EI OK\")","v":{"$error":"#REF!"}},{"$f":"IF(LOOKUP(F148,#REF!,#REF!)>F150,\"OK\",\"EI OK\")","v":{"$error":"#REF!"}},{"$f":"IF(LOOKUP(G148,#REF!,#REF!)>G150,\"OK\",\"EI OK\")","v":{"$error":"#REF!"}},{"$f":"IF(LOOKUP(H148,#REF!,#REF!)>H150,\"OK\",\"EI OK\")","v":{"$error":"#REF!"}}]
["KLMA 2kpl 4x0.8 18,5 ohm / km",null,null,null,{"$f":"IF(LOOKUP(E148,#REF!,#REF!)>E150,\"OK\",\"EI OK\")","v":{"$error":"#REF!"}},{"$f":"IF(LOOKUP(F148,#REF!,#REF!)>F150,\"OK\",\"EI OK\")","v":{"$error":"#REF!"}},{"$f":"IF(LOOKUP(G148,#REF!,#REF!)>G150,\"OK\",\"EI OK\")","v":{"$error":"#REF!"}},{"$f":"IF(LOOKUP(H148,#REF!,#REF!)>H150,\"OK\",\"EI OK\")","v":{"$error":"#REF!"}}]
[]
["Osoitteet linjassa tasavälein"]
["KLMA 2x0.8 74 ohm / km",null,null,null,{"$f":"IF(AM225>=25,\"OK\",\"TOO LONG\")","v":{"$error":"#DIV/0!"}},{"$f":"IF(BE225>=25,\"OK\",\"TOO LONG\")","v":{"$error":"#DIV/0!"}}]
["KLMA 4x0.8 37 ohm / km",null,null,null,{"$f":"IF(AM263>=25,\"OK\",\"TOO LONG\")","v":{"$error":"#DIV/0!"}},{"$f":"IF(BE263>=25,\"OK\",\"TOO LONG\")","v":{"$error":"#DIV/0!"}}]
["ELQYB 2x1,0 50 ohm / km",null,null,null,{"$f":"IF(AM301>=25,\"OK\",\"TOO LONG\")","v":{"$error":"#DIV/0!"}},{"$f":"IF(BE301>=25,\"OK\",\"TOO LONG\")","v":{"$error":"#DIV/0!"}}]
["ELQYB 4x1,0 25 ohm / km",null,null,null,{"$f":"IF(AM339>=25,\"OK\",\"TOO LONG\")","v":{"$error":"#DIV/0!"}},{"$f":"IF(BE339>=25,\"OK\",\"TOO LONG\")","v":{"$error":"#DIV/0!"}}]
["KLM 2x1,0 50 ohm / km",null,null,null,{"$f":"IF(AM301>=25,\"OK\",\"TOO LONG\")","v":{"$error":"#DIV/0!"}},{"$f":"IF(BE301>=25,\"OK\",\"TOO LONG\")","v":{"$error":"#DIV/0!"}}]
["KLM 4x1,0 25 ohm / km",null,null,null,{"$f":"IF(AM339>=25,\"OK\",\"TOO LONG\")","v":{"$error":"#DIV/0!"}},{"$f":"IF(BE339>=25,\"OK\",\"TOO LONG\")","v":{"$error":"#DIV/0!"}}]
["Osoitteet silmukan päässä",null,null,null,{"$f":"IF(AM342>=25,\"OK\",\"TOO LONG\")","v":"TOO LONG"},{"$f":"IF(BE342>=25,\"OK\",\"TOO LONG\")","v":"TOO LONG"}]
["KLMA 2x0.8 74 ohm / km",null,null,null,"TOO LONG","TOO LONG",{"$f":"IF(LOOKUP(G148,#REF!,#REF!)>G150,\"OK\",\"EI OK\")","v":{"$error":"#REF!"}},{"$f":"IF(LOOKUP(H148,#REF!,#REF!)>H150,\"OK\",\"EI OK\")","v":{"$error":"#REF!"}}]
["KLMA 4x0.8 37 ohm / km",null,null,null,"TOO LONG","TOO LONG",{"$f":"IF(LOOKUP(G148,#REF!,#REF!)>G150,\"OK\",\"EI OK\")","v":{"$error":"#REF!"}},{"$f":"IF(LOOKUP(H148,#REF!,#REF!)>H150,\"OK\",\"EI OK\")","v":{"$error":"#REF!"}}]
["KLMA 2kpl 4x0.8 18,5 ohm / km",null,null,null,"TOO LONG","TOO LONG",{"$f":"IF(LOOKUP(G148,#REF!,#REF!)>G150,\"OK\",\"EI OK\")","v":{"$error":"#REF!"}},{"$f":"IF(LOOKUP(H148,#REF!,#REF!)>H150,\"OK\",\"EI OK\")","v":{"$error":"#REF!"}}]
[]
["Osoitteet linjan päässä"]
["KLMA 2x0.8 74 ohm / km",null,null,null,{"$f":"IF(G227<=15,\"OK\",\"TOO LONG\")","v":"OK"},{"$f":"IF(H227<=15,\"OK\",\"TOO LONG\")","v":"OK"}]
["KLMA 4x0.8 37 ohm / km",null,null,null,{"$f":"IF(G228<=15,\"OK\",\"TOO LONG\")","v":"OK"},"OK"]
["ELQYB 2x1,0 50 ohm / km",null,null,null,"OK","OK"]
["ELQYB 4x1,0 25 ohm / km",null,null,null,"OK","OK"]
["KLM 2x1,0 50 ohm / km",null,null,null,{"$f":"IF(G229<=15,\"OK\",\"TOO LONG\")","v":"OK"},{"$f":"IF(H229<=15,\"OK\",\"TOO LONG\")","v":"OK"}]
["KLM 4x1,0 25 ohm / km",null,null,null,{"$f":"IF(G230<=15,\"OK\",\"TOO LONG\")","v":"OK"},{"$f":"IF(H230<=15,\"OK\",\"TOO LONG\")","v":"OK"}]
[]
[]
[]
["Loop cabling equal distance"]
[null,null,null,null,"jännite 25V-40V","N89 28V-40V"]
[null,null,null,null,null,null,"ELQYB/KLM 4x1.0\n25 ohm/km",null,"ELQYB/KLM 2x1.0\n50 ohms/km",null,"KLMA 4x0.8\n37 ohm/km",null,"KLMA 2x0.8\n74 ohm/km",null,"[m]",null,"metrit"]
[null,null,null,null,null,null,"I, [mA]","I, [mA]","I, [mA]","I, [mA]","I, [mA]","I, [mA]","I, [mA]","I, [mA]"]
[null,null,null,null,null,null,{"$f":"((15/(2*25*Q186*0.001))*1000)","v":6000},{"$f":"((15/(2*25*P186*0.001))*1000)","v":300},{"$f":"((15/(2*50*Q186*0.001))*1000)","v":3000},{"$f":"((15/(2*50*P186*0.001))*1000)","v":150},{"$f":"((15/(2*37*Q186*0.001))*1000)","v":4054.0540540540537},{"$f":"((15/(2*37*P186*0.001))*1000)","v":202.70270270270271},{"$f":"((15/(2*74*Q186*0.001))*1000)","v":2027.0270270270269},{"$f":"((15/(2*74*P186*0.001))*1000)","v":101.35135135135135},0,1000,50]
[null,null,null,null,null,null,3000,{"$f":"((15/(2*25*P187*0.001))*1000)","v":333.33333333333331},1500,{"$f":"((15/(2*50*P187*0.001))*1000)","v":166.66666666666666},2027.0270270270269,{"$f":"((15/(2*37*P187*0.001))*1000)","v":225.22522522522524},1013.5135135135134,{"$f":"((15/(2*74*P187*0.001))*1000)","v":112.61261261261262},280,900,100]
[null,null,null,null,null,null,1500,375,750,187.5,1013.5135135135134,253.37837837837836,506.75675675675672,126.68918918918918,500,800,200]
[null,null,null,null,null,null,1000,428.57142857142856,500,214.28571428571428,675.67567567567562,289.57528957528956,337.83783783783781,144.78764478764478,1000,700,300]
[null,null,null,null,null,null,750,500,375,250,506.75675675675672,337.83783783783781,253.37837837837836,168.91891891891891,1500,600,400]
[null,null,null,null,null,null,600,600,300,300,405.40540540540542,405.40540540540542,202.70270270270271,202.70270270270271,2000,500,500]
[null,null,null,null,null,null,500,750,250,375,337.83783783783781,506.75675675675672,168.91891891891891,253.37837837837836,2001,400,600]
[null,null,null,null,null,null,428.57142857142856,1000,214.28571428571428,500,289.57528957528956,675.67567567567562,144.78764478764478,337.83783783783781,null,300,700]
[null,null,null,null,null,null,375,1500,187.5,750,253.37837837837836,1013.5135135135134,126.68918918918918,506.75675675675672,null,200,800]
[null,null,null,null,null,null,333.33333333333331,3000,166.66666666666666,1500,225.22522522522524,2027.0270270270269,112.61261261261262,1013.5135135135134,null,100,900,null,null,null,null,null,null,"Kaapelin ominaisresistanssi",null,74,"ohm/km",null,null,null,null,null,null,null,null,null,null,null,null,null,null,"Kaapelin ominaisresistanssi",null,74,"ohm/km"]
[null,null,null,null,null,null,{"$f":"((15/(2*25*Q196*0.001))*1000)","v":300},6000,{"$f":"((15/(2*50*Q196*0.001))*1000)","v":150},3000,{"$f":"((15/(2*37*Q196*0.001))*1000)","v":202.70270270270271},4054.0540540540537,{"$f":"((15/(2*74*Q196*0.001))*1000)","v":101.35135135135135},2027.0270270270269,null,50,1000,null,null,null,null,null,null,"Kaapelivastus/silmukka",null,{"$f":"((Z195*Z197)/1000)","v":7.3999999999999996E-2},"ohm",null,null,null,null,null,null,null,null,null,null,null,null,null,null,"Kaapelivastus/silmukka",null,{"$f":"((AR195*AR197)/1000)","v":7.3999999999999996E-2},"ohm"]
["Loop cabling worst case",null,null,null,null,null,null,null,null,null,null,null,null,null,null,null,null,null,null,null,null,null,null,"Kaapelin pituus",null,{"$f":"E148","v":1},"m",null,null,null,null,null,null,null,null,null,null,null,null,null,null,"Kaapelin pituus",null,{"$f":"F148","v":1},"m"]
[null,null,null,null,null,null,null,null,null,null,null,null,null,null,null,null,null,null,null,null,null,null,null,"Kuormitus",null,{"$f":"(E150/1000)","v":0},"A",null,null,null,null,null,null,null,null,null,null,null,null,null,null,"Kuormitus",null,{"$f":"(F150/1000)","v":0},"A"]
[null,null,null,null,null,null,"ELQYB/KLM 4x1.0\n25 ohm/km",null,"ELQYB/KLM 2x1.0\n50 ohms/km",null,"KLMA 4x0.8\n37 ohm/km",null,"KLMA 2x0.8\n74 ohm/km",null,"[m]"]
[null,null,null,null,null,null,"I, [mA]","I, [mA]","I, [mA]","I, [mA]","I, [mA]","I, [mA]","I, [mA]"]
[null,null,null,null,null,null,1230,3000,635,3000,835,3000,415,3000,1000,0,null,null,null,null,null,null,"R1",{"$f":"(Z196/10/2)","v":3.6999999999999997E-3},null,null,null,null,null,null,null,null,null,null,null,null,null,null,null,null,"R1",{"$f":"(AR196/10/2)","v":3.6999999999999997E-3}]
[null,null,null,null,null,null,1370,3000,680,3000,925,3000,460,3000,900,100,null,null,null,null,null,1,"R2",{"$f":"(31/(Z198/10))","v":{"$error":"#DIV/0!"}},null,{"$f":"(X201+X202+X203)","v":{"$error":"#DIV/0!"}},{"$f":"(-X202)","v":{"$error":"#DIV/0!"}},0,0,0,0,0,0,0,0,null,40,null,null,null,"R2",{"$f":"(31/(AR198/10))","v":{"$error":"#DIV/0!"}},null,{"$f":"(AP201+AP202+AP203)","v":{"$error":"#DIV/0!"}},{"$f":"(-AP202)","v":{"$error":"#DIV/0!"}},0,0,0,0,0,0,0,0,null,40]
[null,null,null,null,null,null,1540,3000,770,3000,1040,3000,520,2000,800,200,null,null,null,null,null,null,"R3",{"$f":"(Z196/10/2)","v":3.6999999999999997E-3},null,{"$f":"(-X202)","v":{"$error":"#DIV/0!"}},{"$f":"(X204+X205+X206+X202)","v":{"$error":"#DIV/0!"}},{"$f":"(-X205)","v":{"$error":"#DIV/0!"}},0,0,0,0,0,0,0,null,0,null,null,null,"R3",{"$f":"(AR196/10/2)","v":3.6999999999999997E-3},null,{"$f":"(-AP202)","v":{"$error":"#DIV/0!"}},{"$f":"(AP204+AP205+AP206+AP202)","v":{"$error":"#DIV/0!"}},{"$f":"(-AP205)","v":{"$error":"#DIV/0!"}},0,0,0,0,0,0,0,null,0]
[null,null,null,null,null,null,1765,3000,880,2000,1190,3000,595,1350,700,300,null,null,null,null,null,null,"R4",{"$f":"(Z196/10/2)","v":3.6999999999999997E-3},null,0,{"$f":"(-X205)","v":{"$error":"#DIV/0!"}},{"$f":"(X207+X208+X209+X205)","v":{"$error":"#DIV/0!"}},{"$f":"(-X208)","v":{"$error":"#DIV/0!"}},0,0,0,0,0,0,null,0,null,null,null,"R4",{"$f":"(AR196/10/2)","v":3.6999999999999997E-3},null,0,{"$f":"(-AP205)","v":{"$error":"#DIV/0!"}},{"$f":"(AP207+AP208+AP209+AP205)","v":{"$error":"#DIV/0!"}},{"$f":"(-AP208)","v":{"$error":"#DIV/0!"}},0,0,0,0,0,0,null,0]
[null,null,null,null,null,null,2000,3000,1030,1540,1380,2000,695,1040,600,400,null,null,null,null,null,2,"R5",{"$f":"(31/(Z198/10))","v":{"$error":"#DIV/0!"}},null,0,0,{"$f":"(-X208)","v":{"$error":"#DIV/0!"}},{"$f":"(X210+X211+X212+X208)","v":{"$error":"#DIV/0!"}},{"$f":"(-X211)","v":{"$error":"#DIV/0!"}},0,0,0,0,0,null,0,null,null,null,"R5",{"$f":"(31/(AR198/10))","v":{"$error":"#DIV/0!"}},null,0,0,{"$f":"(-AP208)","v":{"$error":"#DIV/0!"}},{"$f":"(AP210+AP211+AP212+AP208)","v":{"$error":"#DIV/0!"}},{"$f":"(-AP211)","v":{"$error":"#DIV/0!"}},0,0,0,0,0,null,0]
[null,null,null,null,null,null,2000,3000,1235,1235,1670,1670,835,835,500,500,null,null,null,null,null,null,"R6",{"$f":"(Z196/10/2)","v":3.6999999999999997E-3},null,0,0,0,{"$f":"(-X211)","v":{"$error":"#DIV/0!"}},{"$f":"(X213+X214+X215+X211)","v":{"$error":"#DIV/0!"}},{"$f":"(-X214)","v":{"$error":"#DIV/0!"}},0,0,0,0,null,0,null,null,null,"R6",{"$f":"(AR196/10/2)","v":3.6999999999999997E-3},null,0,0,0,{"$f":"(-AP211)","v":{"$error":"#DIV/0!"}},{"$f":"(AP213+AP214+AP215+AP211)","v":{"$error":"#DIV/0!"}},{"$f":"(-AP214)","v":{"$error":"#DIV/0!"}},0,0,0,0,null,0]
[null,null,null,null,null,null,2000,2000,1540,1030,2000,1380,1040,695,400,600,null,null,null,null,null,null,"R7",{"$f":"(Z196/10/2)","v":3.6999999999999997E-3},null,0,0,0,0,{"$f":"(-X214)","v":{"$error":"#DIV/0!"}},{"$f":"(X216+X217+X218+X214)","v":{"$error":"#DIV/0!"}},{"$f":"(-X217)","v":{"$error":"#DIV/0!"}},0,0,0,null,0,null,null,null,"R7",{"$f":"(AR196/10/2)","v":3.6999999999999997E-3},null,0,0,0,0,{"$f":"(-AP214)","v":{"$error":"#DIV/0!"}},{"$f":"(AP216+AP217+AP218+AP214)","v":{"$error":"#DIV/0!"}},{"$f":"(-AP217)","v":{"$error":"#DIV/0!"}},0,0,0,null,0]
[null,null,null,null,null,null,2000,1765,2000,880,2000,1190,1350,595,300,700,null,null,null,null,null,3,"R8",{"$f":"(31/(Z198/10))","v":{"$error":"#DIV/0!"}},null,0,0,0,0,0,{"$f":"(-X217)","v":{"$error":"#DIV/0!"}},{"$f":"(X216+X217+X218+X214)","v":{"$error":"#DIV/0!"}},{"$f":"(-X220)","v":{"$error":"#DIV/0!"}},0,0,null,0,null,null,null,"R8",{"$f":"(31/(AR198/10))","v":{"$error":"#DIV/0!"}},null,0,0,0,0,0,{"$f":"(-AP217)","v":{"$error":"#DIV/0!"}},{"$f":"(AP216+AP217+AP218+AP214)","v":{"$error":"#DIV/0!"}},{"$f":"(-AP220)","v":{"$error":"#DIV/0!"}},0,0,null,0]
[null,null,null,null,null,null,2000,1540,2000,770,2000,1040,2000,520,200,800,null,null,null,null,null,null,"R9",{"$f":"(Z196/10/2)","v":3.6999999999999997E-3},null,0,0,0,0,0,0,{"$f":"(-X220)","v":{"$error":"#DIV/0!"}},{"$f":"(X222+X223+X224+X220)","v":{"$error":"#DIV/0!"}},{"$f":"(-X223)","v":{"$error":"#DIV/0!"}},0,null,0,null,null,null,"R9",{"$f":"(AR196/10/2)","v":3.6999999999999997E-3},null,0,0,0,0,0,0,{"$f":"(-AP220)","v":{"$error":"#DIV/0!"}},{"$f":"(AP222+AP223+AP224+AP220)","v":{"$error":"#DIV/0!"}},{"$f":"(-AP223)","v":{"$error":"#DIV/0!"}},0,null,0]
[null,null,null,null,null,null,2000,1370,2000,680,2000,925,2000,460,100,900,null,null,null,null,null,null,"R10",{"$f":"(Z196/10/2)","v":3.6999999999999997E-3},null,0,0,0,0,0,0,0,{"$f":"(-X223)","v":{"$error":"#DIV/0!"}},{"$f":"(X225+X226+X227+X223)","v":{"$error":"#DIV/0!"}},{"$f":"(-X226)","v":{"$error":"#DIV/0!"}},null,0,null,null,null,"R10",{"$f":"(AR196/10/2)","v":3.6999999999999997E-3},null,0,0,0,0,0,0,0,{"$f":"(-AP223)","v":{"$error":"#DIV/0!"}},{"$f":"(AP225+AP226+AP227+AP223)","v":{"$error":"#DIV/0!"}},{"$f":"(-AP226)","v":{"$error":"#DIV/0!"}},null,0]
[null,null,null,null,null,null,2000,1230,2000,610,2000,835,2000,415,0,1000,null,null,null,null,null,4,"R11",{"$f":"(31/(Z198/10))","v":{"$error":"#DIV/0!"}},null,0,0,0,0,0,0,0,0,{"$f":"(-X226)","v":{"$error":"#DIV/0!"}},{"$f":"(X228+X229+X230+X226)","v":{"$error":"#DIV/0!"}},null,0,null,null,null,"R11",{"$f":"(31/(AR198/10))","v":{"$error":"#DIV/0!"}},null,0,0,0,0,0,0,0,0,{"$f":"(-AP226)","v":{"$error":"#DIV/0!"}},{"$f":"(AP228+AP229+AP230+AP226)","v":{"$error":"#DIV/0!"}},null,0]
[null,null,null,null,null,null,null,null,null,null,null,null,null,null,null,null,null,null,null,null,null,null,"R12",{"$f":"(Z196/10/2)","v":3.6999999999999997E-3},null,null,null,null,null,null,null,null,null,null,null,null,null,null,null,null,"R12",{"$f":"(AR196/10/2)","v":3.6999999999999997E-3}]
[null,null,null,null,null,null,null,null,null,null,null,null,null,null,null,null,null,null,null,null,null,null,"R13",{"$f":"(Z196/10/2)","v":3.6999999999999997E-3},null,null,null,null,null,null,null,null,null,null,null,null,null,null,null,null,"R13",{"$f":"(AR196/10/2)","v":3.6999999999999997E-3}]
[null,null,null,null,null,null,null,null,null,null,null,null,null,null,null,null,null,null,null,null,null,5,"R14",{"$f":"(31/(Z198/10))","v":{"$error":"#DIV/0!"}},null,{"$f":"MINVERSE(Z202:AI211)","v":{"$error":"#DIV/0!"}},null,null,null,null,null,null,null,null,null,null,{"$f":"MMULT(_xlfn.ANCHORARRAY(Z214),AK202:AK211)","v":{"$error":"#DIV/0!"}},null,null,null,"R14",{"$f":"(31/(AR198/10))","v":{"$error":"#DIV/0!"}},null,{"$f":"MINVERSE(AR202:BA211)","v":{"$error":"#DIV/0!"}},null,null,null,null,null,null,null,null,null,null,{"$f":"MMULT(_xlfn.ANCHORARRAY(AR214),BC202:BC211)","v":{"$error":"#DIV/0!"}}]
[null,null,null,null,null,null,null,null,null,null,null,null,null,null,null,null,null,null,null,null,null,null,"R15",{"$f":"(Z196/10/2)","v":3.6999999999999997E-3},null,null,null,null,null,null,null,null,null,null,null,null,null,null,null,null,"R15",{"$f":"(AR196/10/2)","v":3.6999999999999997E-3}]
[null,null,null,null,null,null,null,null,null,null,null,null,null,null,null,null,null,null,null,null,null,null,"R16",{"$f":"(Z196/10/2)","v":3.6999999999999997E-3},null,null,null,null,null,null,null,null,null,null,null,null,null,null,null,null,"R16",{"$f":"(AR196/10/2)","v":3.6999999999999997E-3}]
[null,null,null,null,null,null,null,null,null,null,null,null,null,null,null,null,null,null,null,null,null,6,"R17",{"$f":"(31/(Z198/10))","v":{"$error":"#DIV/0!"}},null,null,null,null,null,null,null,null,null,null,null,null,null,null,null,null,"R17",{"$f":"(31/(AR198/10))","v":{"$error":"#DIV/0!"}}]
[null,null,null,null,null,null,null,null,null,null,null,null,null,null,null,null,null,null,null,null,null,null,"R18",{"$f":"(Z196/10/2)","v":3.6999999999999997E-3},null,null,null,null,null,null,null,null,null,null,null,null,null,null,null,null,"R18",{"$f":"(AR196/10/2)","v":3.6999999999999997E-3}]
[null,null,null,null,null,null,null,null,null,null,null,null,null,null,null,null,null,null,null,null,null,null,"R19",{"$f":"(Z196/10/2)","v":3.6999999999999997E-3},null,null,null,null,null,null,null,null,null,null,null,null,null,null,null,null,"R19",{"$f":"(AR196/10/2)","v":3.6999999999999997E-3}]
[null,null,null,null,null,null,null,null,null,null,null,null,null,null,null,null,null,null,null,null,null,7,"R20",{"$f":"(31/(Z198/10))","v":{"$error":"#DIV/0!"}},null,null,null,null,null,null,null,null,null,null,null,null,null,null,null,null,"R20",{"$f":"(31/(AR198/10))","v":{"$error":"#DIV/0!"}}]
[null,null,null,null,null,null,null,null,null,null,null,null,null,null,null,null,null,null,null,null,null,null,"R21",{"$f":"(Z196/10/2)","v":3.6999999999999997E-3},null,null,null,null,null,null,null,null,null,null,null,null,null,null,null,null,"R21",{"$f":"(AR196/10/2)","v":3.6999999999999997E-3}]
[null,null,null,null,null,null,null,null,null,null,null,null,null,null,null,null,null,null,null,null,null,null,"R22",{"$f":"(Z196/10/2)","v":3.6999999999999997E-3},null,null,null,null,null,null,null,null,null,null,null,null,null,null,null,null,"R22",{"$f":"(AR196/10/2)","v":3.6999999999999997E-3}]
[null,null,null,null,null,null,null,null,null,null,null,null,null,null,null,null,null,null,null,null,null,8,"R23",{"$f":"(31/(Z198/10))","v":{"$error":"#DIV/0!"}},null,null,null,null,null,null,null,null,null,null,null,null,null,null,null,null,"R23",{"$f":"(31/(AR198/10))","v":{"$error":"#DIV/0!"}}]
[null,null,null,null,null,null,null,null,null,null,null,null,null,null,null,null,null,null,null,null,null,null,"R24",{"$f":"(Z196/10/2)","v":3.6999999999999997E-3},null,null,null,null,null,null,null,null,null,null,null,null,null,null,null,null,"R24",{"$f":"(AR196/10/2)","v":3.6999999999999997E-3}]
[null,null,null,null,null,null,null,null,null,null,null,null,null,null,null,null,null,null,null,null,null,null,"R25",{"$f":"(Z196/10/2)","v":3.6999999999999997E-3},null,null,null,null,null,null,null,null,null,null,null,null,null,"UR30",{"$f":"(X229*AK223)","v":{"$error":"#DIV/0!"}},null,"R25",{"$f":"(AR196/10/2)","v":3.6999999999999997E-3},null,null,null,null,null,null,null,null,null,null,null,null,null,"UR30",{"$f":"(AP229*BC223)","v":{"$error":"#DIV/0!"}}]
[null,null,null,null,null,null,"Worst case jännitehäviö",null,null,null,null,null,null,null,null,null,null,null,null,null,null,9,"R26",{"$f":"(31/(Z198/10))","v":{"$error":"#DIV/0!"}},null,null,null,null,null,null,null,null,null,null,null,null,null,null,null,null,"R26",{"$f":"(31/(AR198/10))","v":{"$error":"#DIV/0!"}}]
["KLMA 2x0.8 74 ohm / km",null,null,null,null,null,{"$f":"((E150/1000)*2*74*(E148/1000))","v":0},{"$f":"((F150/1000)*2*74*(F148/1000))","v":0},null,null,null,null,null,null,null,null,null,null,null,null,null,null,"R27",{"$f":"(Z196/10/2)","v":3.6999999999999997E-3},null,null,null,null,null,null,null,null,null,null,null,null,null,null,null,null,"R27",{"$f":"(AR196/10/2)","v":3.6999999999999997E-3}]
["KLMA 4x0.8 37 ohm / km",null,null,null,null,null,{"$f":"((E150/1000)*2*37*(E148/1000))","v":0},{"$f":"((F150/1000)*2*37*(F148/1000))","v":0},null,null,null,null,null,null,null,null,null,null,null,null,null,null,"R28",{"$f":"(Z196/10/2)","v":3.6999999999999997E-3},null,null,null,null,null,null,null,null,null,null,null,null,null,null,null,null,"R28",{"$f":"(AR196/10/2)","v":3.6999999999999997E-3}]
["ELQYB 2x1,0 50 ohm / km",null,null,null,null,null,{"$f":"((E150/1000)*2*50*(E148/1000))","v":0},{"$f":"((F150/1000)*2*50*(F148/1000))","v":0},null,null,null,null,null,null,null,null,null,null,null,null,null,10,"R29",{"$f":"(31/(Z198/10))","v":{"$error":"#DIV/0!"}},null,null,null,null,null,null,null,null,null,null,null,null,null,null,null,null,"R29",{"$f":"(31/(AR198/10))","v":{"$error":"#DIV/0!"}}]
["ELQYB 4x1,0 25 ohm / km",null,null,null,null,null,{"$f":"((E150/1000)*2*25*(E148/1000))","v":0},{"$f":"((F150/1000)*2*25*(F148/1000))","v":0},null,null,null,null,null,null,null,null,null,null,null,null,null,null,"R30",{"$f":"(Z196/10/2)","v":3.6999999999999997E-3},null,null,null,null,null,null,null,null,null,null,null,null,null,null,null,null,"R30",{"$f":"(AR196/10/2)","v":3.6999999999999997E-3}]
[]
[]
[null,null,null,null,null,null,null,null,null,null,null,null,null,null,null,null,null,null,null,null,null,null,null,"Kaapelin ominaisresistanssi",null,37,"ohm/km",null,null,null,null,null,null,null,null,null,null,null,null,null,null,"Kaapelin ominaisresistanssi",null,37,"ohm/km"]
[null,null,null,null,null,null,null,null,null,null,null,null,null,null,null,null,null,null,null,null,null,null,null,"Kaapelivastus/silmukka",null,{"$f":"((Z233*Z235)/1000)","v":3.6999999999999998E-2},"ohm",null,null,null,null,null,null,null,null,null,null,null,null,null,null,"Kaapelivastus/silmukka",null,{"$f":"((AR233*AR235)/1000)","v":3.6999999999999998E-2},"ohm"]
[null,null,null,null,null,null,null,null,null,null,null,null,null,null,null,null,null,null,null,null,null,null,null,"Kaapelin pituus",null,{"$f":"E148","v":1},"m",null,null,null,null,null,null,null,null,null,null,null,null,null,null,"Kaapelin pituus",null,{"$f":"F148","v":1},"m"]
[null,null,null,null,null,null,null,null,null,null,null,null,null,null,null,null,null,null,null,null,null,null,null,"Kuormitus",null,{"$f":"(E150/1000)","v":0},"A",null,null,null,null,null,null,null,null,null,null,null,null,null,null,"Kuormitus",null,{"$f":"(F150/1000)","v":0},"A"]
[]
[]
[null,null,null,null,null,null,null,null,null,null,null,null,null,null,null,null,null,null,null,null,null,null,"R1",{"$f":"(Z234/10/2)","v":1.8499999999999999E-3},null,null,null,null,null,null,null,null,null,null,null,null,null,null,null,null,"R1",{"$f":"(AR234/10/2)","v":1.8499999999999999E-3}]
[null,null,null,null,null,null,null,null,null,null,null,null,null,null,null,null,null,null,null,null,null,null,"R2",{"$f":"(31/(Z236/10))","v":{"$error":"#DIV/0!"}},null,{"$f":"(X239+X240+X241)","v":{"$error":"#DIV/0!"}},{"$f":"(-X240)","v":{"$error":"#DIV/0!"}},0,0,0,0,0,0,0,0,null,40,null,null,null,"R2",{"$f":"(31/(AR236/10))","v":{"$error":"#DIV/0!"}},null,{"$f":"(AP239+AP240+AP241)","v":{"$error":"#DIV/0!"}},{"$f":"(-AP240)","v":{"$error":"#DIV/0!"}},0,0,0,0,0,0,0,0,null,40]
[null,null,null,null,null,null,null,null,null,null,null,null,null,null,null,null,null,null,null,null,null,null,"R3",{"$f":"(Z234/10/2)","v":1.8499999999999999E-3},null,{"$f":"(-X240)","v":{"$error":"#DIV/0!"}},{"$f":"(X242+X243+X244+X240)","v":{"$error":"#DIV/0!"}},{"$f":"(-X243)","v":{"$error":"#DIV/0!"}},0,0,0,0,0,0,0,null,0,null,null,null,"R3",{"$f":"(AR234/10/2)","v":1.8499999999999999E-3},null,{"$f":"(-AP240)","v":{"$error":"#DIV/0!"}},{"$f":"(AP242+AP243+AP244+AP240)","v":{"$error":"#DIV/0!"}},{"$f":"(-AP243)","v":{"$error":"#DIV/0!"}},0,0,0,0,0,0,0,null,0]
[null,null,null,null,null,null,null,null,null,null,null,null,null,null,null,null,null,null,null,null,null,null,"R4",{"$f":"(Z234/10/2)","v":1.8499999999999999E-3},null,0,{"$f":"(-X243)","v":{"$error":"#DIV/0!"}},{"$f":"(X245+X246+X247+X243)","v":{"$error":"#DIV/0!"}},{"$f":"(-X246)","v":{"$error":"#DIV/0!"}},0,0,0,0,0,0,null,0,null,null,null,"R4",{"$f":"(AR234/10/2)","v":1.8499999999999999E-3},null,0,{"$f":"(-AP243)","v":{"$error":"#DIV/0!"}},{"$f":"(AP245+AP246+AP247+AP243)","v":{"$error":"#DIV/0!"}},{"$f":"(-AP246)","v":{"$error":"#DIV/0!"}},0,0,0,0,0,0,null,0]
[null,null,null,null,null,null,null,null,null,null,null,null,null,null,null,null,null,null,null,null,null,null,"R5",{"$f":"(31/(Z236/10))","v":{"$error":"#DIV/0!"}},null,0,0,{"$f":"(-X246)","v":{"$error":"#DIV/0!"}},{"$f":"(X248+X249+X250+X246)","v":{"$error":"#DIV/0!"}},{"$f":"(-X249)","v":{"$error":"#DIV/0!"}},0,0,0,0,0,null,0,null,null,null,"R5",{"$f":"(31/(AR236/10))","v":{"$error":"#DIV/0!"}},null,0,0,{"$f":"(-AP246)","v":{"$error":"#DIV/0!"}},{"$f":"(AP248+AP249+AP250+AP246)","v":{"$error":"#DIV/0!"}},{"$f":"(-AP249)","v":{"$error":"#DIV/0!"}},0,0,0,0,0,null,0]
[null,null,null,null,null,null,null,null,null,null,null,null,null,null,null,null,null,null,null,null,null,null,"R6",{"$f":"(Z234/10/2)","v":1.8499999999999999E-3},null,0,0,0,{"$f":"(-X249)","v":{"$error":"#DIV/0!"}},{"$f":"(X251+X252+X253+X249)","v":{"$error":"#DIV/0!"}},{"$f":"(-X252)","v":{"$error":"#DIV/0!"}},0,0,0,0,null,0,null,null,null,"R6",{"$f":"(AR234/10/2)","v":1.8499999999999999E-3},null,0,0,0,{"$f":"(-AP249)","v":{"$error":"#DIV/0!"}},{"$f":"(AP251+AP252+AP253+AP249)","v":{"$error":"#DIV/0!"}},{"$f":"(-AP252)","v":{"$error":"#DIV/0!"}},0,0,0,0,null,0]
[null,null,null,null,null,null,null,null,null,null,null,null,null,null,null,null,null,null,null,null,null,null,"R7",{"$f":"(Z234/10/2)","v":1.8499999999999999E-3},null,0,0,0,0,{"$f":"(-X252)","v":{"$error":"#DIV/0!"}},{"$f":"(X254+X255+X256+X252)","v":{"$error":"#DIV/0!"}},{"$f":"(-X255)","v":{"$error":"#DIV/0!"}},0,0,0,null,0,null,null,null,"R7",{"$f":"(AR234/10/2)","v":1.8499999999999999E-3},null,0,0,0,0,{"$f":"(-AP252)","v":{"$error":"#DIV/0!"}},{"$f":"(AP254+AP255+AP256+AP252)","v":{"$error":"#DIV/0!"}},{"$f":"(-AP255)","v":{"$error":"#DIV/0!"}},0,0,0,null,0]
[null,null,null,null,null,null,null,null,null,null,null,null,null,null,null,null,null,null,null,null,null,null,"R8",{"$f":"(31/(Z236/10))","v":{"$error":"#DIV/0!"}},null,0,0,0,0,0,{"$f":"(-X255)","v":{"$error":"#DIV/0!"}},{"$f":"(X254+X255+X256+X252)","v":{"$error":"#DIV/0!"}},{"$f":"(-X258)","v":{"$error":"#DIV/0!"}},0,0,null,0,null,null,null,"R8",{"$f":"(31/(AR236/10))","v":{"$error":"#DIV/0!"}},null,0,0,0,0,0,{"$f":"(-AP255)","v":{"$error":"#DIV/0!"}},{"$f":"(AP254+AP255+AP256+AP252)","v":{"$error":"#DIV/0!"}},{"$f":"(-AP258)","v":{"$error":"#DIV/0!"}},0,0,null,0]
[null,null,null,null,null,null,null,null,null,null,null,null,null,null,null,null,null,null,null,null,null,null,"R9",{"$f":"(Z234/10/2)","v":1.8499999999999999E-3},null,0,0,0,0,0,0,{"$f":"(-X258)","v":{"$error":"#DIV/0!"}},{"$f":"(X260+X261+X262+X258)","v":{"$error":"#DIV/0!"}},{"$f":"(-X261)","v":{"$error":"#DIV/0!"}},0,null,0,null,null,null,"R9",{"$f":"(AR234/10/2)","v":1.8499999999999999E-3},null,0,0,0,0,0,0,{"$f":"(-AP258)","v":{"$error":"#DIV/0!"}},{"$f":"(AP260+AP261+AP262+AP258)","v":{"$error":"#DIV/0!"}},{"$f":"(-AP261)","v":{"$error":"#DIV/0!"}},0,null,0]
[null,null,null,null,null,null,null,null,null,null,null,null,null,null,null,null,null,null,null,null,null,null,"R10",{"$f":"(Z234/10/2)","v":1.8499999999999999E-3},null,0,0,0,0,0,0,0,{"$f":"(-X261)","v":{"$error":"#DIV/0!"}},{"$f":"(X263+X264+X265+X261)","v":{"$error":"#DIV/0!"}},{"$f":"(-X264)","v":{"$error":"#DIV/0!"}},null,0,null,null,null,"R10",{"$f":"(AR234/10/2)","v":1.8499999999999999E-3},null,0,0,0,0,0,0,0,{"$f":"(-AP261)","v":{"$error":"#DIV/0!"}},{"$f":"(AP263+AP264+AP265+AP261)","v":{"$error":"#DIV/0!"}},{"$f":"(-AP264)","v":{"$error":"#DIV/0!"}},null,0]
[null,null,null,null,null,null,null,null,null,null,null,null,null,null,null,null,null,null,null,null,null,null,"R11",{"$f":"(31/(Z236/10))","v":{"$error":"#DIV/0!"}},null,0,0,0,0,0,0,0,0,{"$f":"(-X264)","v":{"$error":"#DIV/0!"}},{"$f":"(X266+X267+X268+X264)","v":{"$error":"#DIV/0!"}},null,0,null,null,null,"R11",{"$f":"(31/(AR236/10))","v":{"$error":"#DIV/0!"}},null,0,0,0,0,0,0,0,0,{"$f":"(-AP264)","v":{"$error":"#DIV/0!"}},{"$f":"(AP266+AP267+AP268+AP264)","v":{"$error":"#DIV/0!"}},null,0]
[null,null,null,null,null,null,null,null,null,null,null,null,null,null,null,null,null,null,null,null,null,null,"R12",{"$f":"(Z234/10/2)","v":1.8499999999999999E-3},null,null,null,null,null,null,null,null,null,null,null,null,null,null,null,null,"R12",{"$f":"(AR234/10/2)","v":1.8499999999999999E-3}]
[null,null,null,null,null,null,null,null,null,null,null,null,null,null,null,null,null,null,null,null,null,null,"R13",{"$f":"(Z234/10/2)","v":1.8499999999999999E-3},null,null,null,null,null,null,null,null,null,null,null,null,null,null,null,null,"R13",{"$f":"(AR234/10/2)","v":1.8499999999999999E-3}]
[null,null,null,null,null,null,null,null,null,null,null,null,null,null,null,null,null,null,null,null,null,null,"R14",{"$f":"(31/(Z236/10))","v":{"$error":"#DIV/0!"}},null,{"$f":"MINVERSE(Z240:AI249)","v":{"$error":"#DIV/0!"}},null,null,null,null,null,null,null,null,null,null,{"$f":"MMULT(_xlfn.ANCHORARRAY(Z252),AK240:AK249)","v":{"$error":"#DIV/0!"}},null,null,null,"R14",{"$f":"(31/(AR236/10))","v":{"$error":"#DIV/0!"}},null,{"$f":"MINVERSE(AR240:BA249)","v":{"$error":"#DIV/0!"}},null,null,null,null,null,null,null,null,null,null,{"$f":"MMULT(_xlfn.ANCHORARRAY(AR252),BC240:BC249)","v":{"$error":"#DIV/0!"}}]
[null,null,null,null,null,null,null,null,null,null,null,null,null,null,null,null,null,null,null,null,null,null,"R15",{"$f":"(Z234/10/2)","v":1.8499999999999999E-3},null,null,null,null,null,null,null,null,null,null,null,null,null,null,null,null,"R15",{"$f":"(AR234/10/2)","v":1.8499999999999999E-3}]
[null,null,null,null,null,null,null,null,null,null,null,null,null,null,null,null,null,null,null,null,null,null,"R16",{"$f":"(Z234/10/2)","v":1.8499999999999999E-3},null,null,null,null,null,null,null,null,null,null,null,null,null,null,null,null,"R16",{"$f":"(AR234/10/2)","v":1.8499999999999999E-3}]
[null,null,null,null,null,null,null,null,null,null,null,null,null,null,null,null,null,null,null,null,null,null,"R17",{"$f":"(31/(Z236/10))","v":{"$error":"#DIV/0!"}},null,null,null,null,null,null,null,null,null,null,null,null,null,null,null,null,"R17",{"$f":"(31/(AR236/10))","v":{"$error":"#DIV/0!"}}]
[null,null,null,null,null,null,null,null,null,null,null,null,null,null,null,null,null,null,null,null,null,null,"R18",{"$f":"(Z234/10/2)","v":1.8499999999999999E-3},null,null,null,null,null,null,null,null,null,null,null,null,null,null,null,null,"R18",{"$f":"(AR234/10/2)","v":1.8499999999999999E-3}]
[null,null,null,null,null,null,null,null,null,null,null,null,null,null,null,null,null,null,null,null,null,null,"R19",{"$f":"(Z234/10/2)","v":1.8499999999999999E-3},null,null,null,null,null,null,null,null,null,null,null,null,null,null,null,null,"R19",{"$f":"(AR234/10/2)","v":1.8499999999999999E-3}]
[null,null,null,null,null,null,null,null,null,null,null,null,null,null,null,null,null,null,null,null,null,null,"R20",{"$f":"(31/(Z236/10))","v":{"$error":"#DIV/0!"}},null,null,null,null,null,null,null,null,null,null,null,null,null,null,null,null,"R20",{"$f":"(31/(AR236/10))","v":{"$error":"#DIV/0!"}}]
[null,null,null,null,null,null,null,null,null,null,null,null,null,null,null,null,null,null,null,null,null,null,"R21",{"$f":"(Z234/10/2)","v":1.8499999999999999E-3},null,null,null,null,null,null,null,null,null,null,null,null,null,null,null,null,"R21",{"$f":"(AR234/10/2)","v":1.8499999999999999E-3}]
[null,null,null,null,null,null,null,null,null,null,null,null,null,null,null,null,null,null,null,null,null,null,"R22",{"$f":"(Z234/10/2)","v":1.8499999999999999E-3},null,null,null,null,null,null,null,null,null,null,null,null,null,null,null,null,"R22",{"$f":"(AR234/10/2)","v":1.8499999999999999E-3}]
[null,null,null,null,null,null,null,null,null,null,null,null,null,null,null,null,null,null,null,null,null,null,"R23",{"$f":"(31/(Z236/10))","v":{"$error":"#DIV/0!"}},null,null,null,null,null,null,null,null,null,null,null,null,null,null,null,null,"R23",{"$f":"(31/(AR236/10))","v":{"$error":"#DIV/0!"}}]
[null,null,null,null,null,null,null,null,null,null,null,null,null,null,null,null,null,null,null,null,null,null,"R24",{"$f":"(Z234/10/2)","v":1.8499999999999999E-3},null,null,null,null,null,null,null,null,null,null,null,null,null,null,null,null,"R24",{"$f":"(AR234/10/2)","v":1.8499999999999999E-3}]
[null,null,null,null,null,null,null,null,null,null,null,null,null,null,null,null,null,null,null,null,null,null,"R25",{"$f":"(Z234/10/2)","v":1.8499999999999999E-3},null,null,null,null,null,null,null,null,null,null,null,null,null,"UR30",{"$f":"(X267*AK261)","v":{"$error":"#DIV/0!"}},null,"R25",{"$f":"(AR234/10/2)","v":1.8499999999999999E-3},null,null,null,null,null,null,null,null,null,null,null,null,null,"UR30",{"$f":"(AP267*BC261)","v":{"$error":"#DIV/0!"}}]
[null,null,null,null,null,null,null,null,null,null,null,null,null,null,null,null,null,null,null,null,null,null,"R26",{"$f":"(31/(Z236/10))","v":{"$error":"#DIV/0!"}},null,null,null,null,null,null,null,null,null,null,null,null,null,null,null,null,"R26",{"$f":"(31/(AR236/10))","v":{"$error":"#DIV/0!"}}]
[null,null,null,null,null,null,null,null,null,null,null,null,null,null,null,null,null,null,null,null,null,null,"R27",{"$f":"(Z234/10/2)","v":1.8499999999999999E-3},null,null,null,null,null,null,null,null,null,null,null,null,null,null,null,null,"R27",{"$f":"(AR234/10/2)","v":1.8499999999999999E-3}]
[null,null,null,null,null,null,null,null,null,null,null,null,null,null,null,null,null,null,null,null,null,null,"R28",{"$f":"(Z234/10/2)","v":1.8499999999999999E-3},null,null,null,null,null,null,null,null,null,null,null,null,null,null,null,null,"R28",{"$f":"(AR234/10/2)","v":1.8499999999999999E-3}]
[null,null,null,null,null,null,null,null,null,null,null,null,null,null,null,null,null,null,null,null,null,null,"R29",{"$f":"(31/(Z236/10))","v":{"$error":"#DIV/0!"}},null,null,null,null,null,null,null,null,null,null,null,null,null,null,null,null,"R29",{"$f":"(31/(AR236/10))","v":{"$error":"#DIV/0!"}}]
[null,null,null,null,null,null,null,null,null,null,null,null,null,null,null,null,null,null,null,null,null,null,"R30",{"$f":"(Z234/10/2)","v":1.8499999999999999E-3},null,null,null,null,null,null,null,null,null,null,null,null,null,null,null,null,"R30",{"$f":"(AR234/10/2)","v":1.8499999999999999E-3}]
[]
[]
[null,null,null,null,null,null,null,null,null,null,null,null,null,null,null,null,null,null,null,null,null,null,null,"Kaapelin ominaisresistanssi",null,50,"ohm/km",null,null,null,null,null,null,null,null,null,null,null,null,null,null,"Kaapelin ominaisresistanssi",null,50,"ohm/km"]
[null,null,null,null,null,null,null,null,null,null,null,null,null,null,null,null,null,null,null,null,null,null,null,"Kaapelivastus/silmukka",null,{"$f":"((Z271*Z273)/1000)","v":0.05},"ohm",null,null,null,null,null,null,null,null,null,null,null,null,null,null,"Kaapelivastus/silmukka",null,{"$f":"((AR271*AR273)/1000)","v":0.05},"ohm"]
[null,null,null,null,null,null,null,null,null,null,null,null,null,null,null,null,null,null,null,null,null,null,null,"Kaapelin pituus",null,{"$f":"E148","v":1},"m",null,null,null,null,null,null,null,null,null,null,null,null,null,null,"Kaapelin pituus",null,{"$f":"F148","v":1},"m"]
[null,null,null,null,null,null,null,null,null,null,null,null,null,null,null,null,null,null,null,null,null,null,null,"Kuormitus",null,{"$f":"E150/1000","v":0},"A",null,null,null,null,null,null,null,null,null,null,null,null,null,null,"Kuormitus",null,{"$f":"(F150/1000)","v":0},"A"]
[]
[]
[null,null,null,null,null,null,null,null,null,null,null,null,null,null,null,null,null,null,null,null,null,null,"R1",{"$f":"(Z272/10/2)","v":2.5000000000000001E-3},null,null,null,null,null,null,null,null,null,null,null,null,null,null,null,null,"R1",{"$f":"(AR272/10/2)","v":2.5000000000000001E-3}]
[null,null,null,null,null,null,null,null,null,null,null,null,null,null,null,null,null,null,null,null,null,null,"R2",{"$f":"(31/(Z274/10))","v":{"$error":"#DIV/0!"}},null,{"$f":"(X277+X278+X279)","v":{"$error":"#DIV/0!"}},{"$f":"(-X278)","v":{"$error":"#DIV/0!"}},0,0,0,0,0,0,0,0,null,40,null,null,null,"R2",{"$f":"(31/(AR274/10))","v":{"$error":"#DIV/0!"}},null,{"$f":"(AP277+AP278+AP279)","v":{"$error":"#DIV/0!"}},{"$f":"(-AP278)","v":{"$error":"#DIV/0!"}},0,0,0,0,0,0,0,0,null,40]
[null,null,null,null,null,null,null,null,null,null,null,null,null,null,null,null,null,null,null,null,null,null,"R3",{"$f":"(Z272/10/2)","v":2.5000000000000001E-3},null,{"$f":"(-X278)","v":{"$error":"#DIV/0!"}},{"$f":"(X280+X281+X282+X278)","v":{"$error":"#DIV/0!"}},{"$f":"(-X281)","v":{"$error":"#DIV/0!"}},0,0,0,0,0,0,0,null,0,null,null,null,"R3",{"$f":"(AR272/10/2)","v":2.5000000000000001E-3},null,{"$f":"(-AP278)","v":{"$error":"#DIV/0!"}},{"$f":"(AP280+AP281+AP282+AP278)","v":{"$error":"#DIV/0!"}},{"$f":"(-AP281)","v":{"$error":"#DIV/0!"}},0,0,0,0,0,0,0,null,0]
[null,null,null,null,null,null,null,null,null,null,null,null,null,null,null,null,null,null,null,null,null,null,"R4",{"$f":"(Z272/10/2)","v":2.5000000000000001E-3},null,0,{"$f":"(-X281)","v":{"$error":"#DIV/0!"}},{"$f":"(X283+X284+X285+X281)","v":{"$error":"#DIV/0!"}},{"$f":"(-X284)","v":{"$error":"#DIV/0!"}},0,0,0,0,0,0,null,0,null,null,null,"R4",{"$f":"(AR272/10/2)","v":2.5000000000000001E-3},null,0,{"$f":"(-AP281)","v":{"$error":"#DIV/0!"}},{"$f":"(AP283+AP284+AP285+AP281)","v":{"$error":"#DIV/0!"}},{"$f":"(-AP284)","v":{"$error":"#DIV/0!"}},0,0,0,0,0,0,null,0]
[null,null,null,null,null,null,null,null,null,null,null,null,null,null,null,null,null,null,null,null,null,null,"R5",{"$f":"(31/(Z274/10))","v":{"$error":"#DIV/0!"}},null,0,0,{"$f":"(-X284)","v":{"$error":"#DIV/0!"}},{"$f":"(X286+X287+X288+X284)","v":{"$error":"#DIV/0!"}},{"$f":"(-X287)","v":{"$error":"#DIV/0!"}},0,0,0,0,0,null,0,null,null,null,"R5",{"$f":"(31/(AR274/10))","v":{"$error":"#DIV/0!"}},null,0,0,{"$f":"(-AP284)","v":{"$error":"#DIV/0!"}},{"$f":"(AP286+AP287+AP288+AP284)","v":{"$error":"#DIV/0!"}},{"$f":"(-AP287)","v":{"$error":"#DIV/0!"}},0,0,0,0,0,null,0]
[null,null,null,null,null,null,null,null,null,null,null,null,null,null,null,null,null,null,null,null,null,null,"R6",{"$f":"(Z272/10/2)","v":2.5000000000000001E-3},null,0,0,0,{"$f":"(-X287)","v":{"$error":"#DIV/0!"}},{"$f":"(X289+X290+X291+X287)","v":{"$error":"#DIV/0!"}},{"$f":"(-X290)","v":{"$error":"#DIV/0!"}},0,0,0,0,null,0,null,null,null,"R6",{"$f":"(AR272/10/2)","v":2.5000000000000001E-3},null,0,0,0,{"$f":"(-AP287)","v":{"$error":"#DIV/0!"}},{"$f":"(AP289+AP290+AP291+AP287)","v":{"$error":"#DIV/0!"}},{"$f":"(-AP290)","v":{"$error":"#DIV/0!"}},0,0,0,0,null,0]
[null,null,null,null,null,null,null,null,null,null,null,null,null,null,null,null,null,null,null,null,null,null,"R7",{"$f":"(Z272/10/2)","v":2.5000000000000001E-3},null,0,0,0,0,{"$f":"(-X290)","v":{"$error":"#DIV/0!"}},{"$f":"(X292+X293+X294+X290)","v":{"$error":"#DIV/0!"}},{"$f":"(-X293)","v":{"$error":"#DIV/0!"}},0,0,0,null,0,null,null,null,"R7",{"$f":"(AR272/10/2)","v":2.5000000000000001E-3},null,0,0,0,0,{"$f":"(-AP290)","v":{"$error":"#DIV/0!"}},{"$f":"(AP292+AP293+AP294+AP290)","v":{"$error":"#DIV/0!"}},{"$f":"(-AP293)","v":{"$error":"#DIV/0!"}},0,0,0,null,0]
[null,null,null,null,null,null,null,null,null,null,null,null,null,null,null,null,null,null,null,null,null,null,"R8",{"$f":"(31/(Z274/10))","v":{"$error":"#DIV/0!"}},null,0,0,0,0,0,{"$f":"(-X293)","v":{"$error":"#DIV/0!"}},{"$f":"(X292+X293+X294+X290)","v":{"$error":"#DIV/0!"}},{"$f":"(-X296)","v":{"$error":"#DIV/0!"}},0,0,null,0,null,null,null,"R8",{"$f":"(31/(AR274/10))","v":{"$error":"#DIV/0!"}},null,0,0,0,0,0,{"$f":"(-AP293)","v":{"$error":"#DIV/0!"}},{"$f":"(AP292+AP293+AP294+AP290)","v":{"$error":"#DIV/0!"}},{"$f":"(-AP296)","v":{"$error":"#DIV/0!"}},0,0,null,0]
[null,null,null,null,null,null,null,null,null,null,null,null,null,null,null,null,null,null,null,null,null,null,"R9",{"$f":"(Z272/10/2)","v":2.5000000000000001E-3},null,0,0,0,0,0,0,{"$f":"(-X296)","v":{"$error":"#DIV/0!"}},{"$f":"(X298+X299+X300+X296)","v":{"$error":"#DIV/0!"}},{"$f":"(-X299)","v":{"$error":"#DIV/0!"}},0,null,0,null,null,null,"R9",{"$f":"(AR272/10/2)","v":2.5000000000000001E-3},null,0,0,0,0,0,0,{"$f":"(-AP296)","v":{"$error":"#DIV/0!"}},{"$f":"(AP298+AP299+AP300+AP296)","v":{"$error":"#DIV/0!"}},{"$f":"(-AP299)","v":{"$error":"#DIV/0!"}},0,null,0]
[null,null,null,null,null,null,null,null,null,null,null,null,null,null,null,null,null,null,null,null,null,null,"R10",{"$f":"(Z272/10/2)","v":2.5000000000000001E-3},null,0,0,0,0,0,0,0,{"$f":"(-X299)","v":{"$error":"#DIV/0!"}},{"$f":"(X301+X302+X303+X299)","v":{"$error":"#DIV/0!"}},{"$f":"(-X302)","v":{"$error":"#DIV/0!"}},null,0,null,null,null,"R10",{"$f":"(AR272/10/2)","v":2.5000000000000001E-3},null,0,0,0,0,0,0,0,{"$f":"(-AP299)","v":{"$error":"#DIV/0!"}},{"$f":"(AP301+AP302+AP303+AP299)","v":{"$error":"#DIV/0!"}},{"$f":"(-AP302)","v":{"$error":"#DIV/0!"}},null,0]
[null,null,null,null,null,null,null,null,null,null,null,null,null,null,null,null,null,null,null,null,null,null,"R11",{"$f":"(31/(Z274/10))","v":{"$error":"#DIV/0!"}},null,0,0,0,0,0,0,0,0,{"$f":"(-X302)","v":{"$error":"#DIV/0!"}},{"$f":"(X304+X305+X306+X302)","v":{"$error":"#DIV/0!"}},null,0,null,null,null,"R11",{"$f":"(31/(AR274/10))","v":{"$error":"#DIV/0!"}},null,0,0,0,0,0,0,0,0,{"$f":"(-AP302)","v":{"$error":"#DIV/0!"}},{"$f":"(AP304+AP305+AP306+AP302)","v":{"$error":"#DIV/0!"}},null,0]
[null,null,null,null,null,null,null,null,null,null,null,null,null,null,null,null,null,null,null,null,null,null,"R12",{"$f":"(Z272/10/2)","v":2.5000000000000001E-3},null,null,null,null,null,null,null,null,null,null,null,null,null,null,null,null,"R12",{"$f":"(AR272/10/2)","v":2.5000000000000001E-3}]
[null,null,null,null,null,null,null,null,null,null,null,null,null,null,null,null,null,null,null,null,null,null,"R13",{"$f":"(Z272/10/2)","v":2.5000000000000001E-3},null,null,null,null,null,null,null,null,null,null,null,null,null,null,null,null,"R13",{"$f":"(AR272/10/2)","v":2.5000000000000001E-3}]
[null,null,null,null,null,null,null,null,null,null,null,null,null,null,null,null,null,null,null,null,null,null,"R14",{"$f":"(31/(Z274/10))","v":{"$error":"#DIV/0!"}},null,{"$f":"MINVERSE(Z278:AI287)","v":{"$error":"#DIV/0!"}},null,null,null,null,null,null,null,null,null,null,{"$f":"MMULT(_xlfn.ANCHORARRAY(Z290),AK278:AK287)","v":{"$error":"#DIV/0!"}},null,null,null,"R14",{"$f":"(31/(AR274/10))","v":{"$error":"#DIV/0!"}},null,{"$f":"MINVERSE(AR278:BA287)","v":{"$error":"#DIV/0!"}},null,null,null,null,null,null,null,null,null,null,{"$f":"MMULT(_xlfn.ANCHORARRAY(AR290),BC278:BC287)","v":{"$error":"#DIV/0!"}}]
[null,null,null,null,null,null,null,null,null,null,null,null,null,null,null,null,null,null,null,null,null,null,"R15",{"$f":"(Z272/10/2)","v":2.5000000000000001E-3},null,null,null,null,null,null,null,null,null,null,null,null,null,null,null,null,"R15",{"$f":"(AR272/10/2)","v":2.5000000000000001E-3}]
[null,null,null,null,null,null,null,null,null,null,null,null,null,null,null,null,null,null,null,null,null,null,"R16",{"$f":"(Z272/10/2)","v":2.5000000000000001E-3},null,null,null,null,null,null,null,null,null,null,null,null,null,null,null,null,"R16",{"$f":"(AR272/10/2)","v":2.5000000000000001E-3}]
[null,null,null,null,null,null,null,null,null,null,null,null,null,null,null,null,null,null,null,null,null,null,"R17",{"$f":"(31/(Z274/10))","v":{"$error":"#DIV/0!"}},null,null,null,null,null,null,null,null,null,null,null,null,null,null,null,null,"R17",{"$f":"(31/(AR274/10))","v":{"$error":"#DIV/0!"}}]
[null,null,null,null,null,null,null,null,null,null,null,null,null,null,null,null,null,null,null,null,null,null,"R18",{"$f":"(Z272/10/2)","v":2.5000000000000001E-3},null,null,null,null,null,null,null,null,null,null,null,null,null,null,null,null,"R18",{"$f":"(AR272/10/2)","v":2.5000000000000001E-3}]
[null,null,null,null,null,null,null,null,null,null,null,null,null,null,null,null,null,null,null,null,null,null,"R19",{"$f":"(Z272/10/2)","v":2.5000000000000001E-3},null,null,null,null,null,null,null,null,null,null,null,null,null,null,null,null,"R19",{"$f":"(AR272/10/2)","v":2.5000000000000001E-3}]
[null,null,null,null,null,null,null,null,null,null,null,null,null,null,null,null,null,null,null,null,null,null,"R20",{"$f":"(31/(Z274/10))","v":{"$error":"#DIV/0!"}},null,null,null,null,null,null,null,null,null,null,null,null,null,null,null,null,"R20",{"$f":"(31/(AR274/10))","v":{"$error":"#DIV/0!"}}]
[null,null,null,null,null,null,null,null,null,null,null,null,null,null,null,null,null,null,null,null,null,null,"R21",{"$f":"(Z272/10/2)","v":2.5000000000000001E-3},null,null,null,null,null,null,null,null,null,null,null,null,null,null,null,null,"R21",{"$f":"(AR272/10/2)","v":2.5000000000000001E-3}]
[null,null,null,null,null,null,null,null,null,null,null,null,null,null,null,null,null,null,null,null,null,null,"R22",{"$f":"(Z272/10/2)","v":2.5000000000000001E-3},null,null,null,null,null,null,null,null,null,null,null,null,null,null,null,null,"R22",{"$f":"(AR272/10/2)","v":2.5000000000000001E-3}]
[null,null,null,null,null,null,null,null,null,null,null,null,null,null,null,null,null,null,null,null,null,null,"R23",{"$f":"(31/(Z274/10))","v":{"$error":"#DIV/0!"}},null,null,null,null,null,null,null,null,null,null,null,null,null,null,null,null,"R23",{"$f":"(31/(AR274/10))","v":{"$error":"#DIV/0!"}}]
[null,null,null,null,null,null,null,null,null,null,null,null,null,null,null,null,null,null,null,null,null,null,"R24",{"$f":"(Z272/10/2)","v":2.5000000000000001E-3},null,null,null,null,null,null,null,null,null,null,null,null,null,null,null,null,"R24",{"$f":"(AR272/10/2)","v":2.5000000000000001E-3}]
[null,null,null,null,null,null,null,null,null,null,null,null,null,null,null,null,null,null,null,null,null,null,"R25",{"$f":"(Z272/10/2)","v":2.5000000000000001E-3},null,null,null,null,null,null,null,null,null,null,null,null,null,"UR30",{"$f":"(X305*AK299)","v":{"$error":"#DIV/0!"}},null,"R25",{"$f":"(AR272/10/2)","v":2.5000000000000001E-3},null,null,null,null,null,null,null,null,null,null,null,null,null,"UR30",{"$f":"(AP305*BC299)","v":{"$error":"#DIV/0!"}}]
[null,null,null,null,null,null,null,null,null,null,null,null,null,null,null,null,null,null,null,null,null,null,"R26",{"$f":"(31/(Z274/10))","v":{"$error":"#DIV/0!"}},null,null,null,null,null,null,null,null,null,null,null,null,null,null,null,null,"R26",{"$f":"(31/(AR274/10))","v":{"$error":"#DIV/0!"}}]
[null,null,null,null,null,null,null,null,null,null,null,null,null,null,null,null,null,null,null,null,null,null,"R27",{"$f":"(Z272/10/2)","v":2.5000000000000001E-3},null,null,null,null,null,null,null,null,null,null,null,null,null,null,null,null,"R27",{"$f":"(AR272/10/2)","v":2.5000000000000001E-3}]
[null,null,null,null,null,null,null,null,null,null,null,null,null,null,null,null,null,null,null,null,null,null,"R28",{"$f":"(Z272/10/2)","v":2.5000000000000001E-3},null,null,null,null,null,null,null,null,null,null,null,null,null,null,null,null,"R28",{"$f":"(AR272/10/2)","v":2.5000000000000001E-3}]
[null,null,null,null,null,null,null,null,null,null,null,null,null,null,null,null,null,null,null,null,null,null,"R29",{"$f":"(31/(Z274/10))","v":{"$error":"#DIV/0!"}},null,null,null,null,null,null,null,null,null,null,null,null,null,null,null,null,"R29",{"$f":"(31/(AR274/10))","v":{"$error":"#DIV/0!"}}]
[null,null,null,null,null,null,null,null,null,null,null,null,null,null,null,null,null,null,null,null,null,null,"R30",{"$f":"(Z272/10/2)","v":2.5000000000000001E-3},null,null,null,null,null,null,null,null,null,null,null,null,null,null,null,null,"R30",{"$f":"(AR272/10/2)","v":2.5000000000000001E-3}]
[]
[]
[null,null,null,null,null,null,null,null,null,null,null,null,null,null,null,null,null,null,null,null,null,null,null,"Kaapelin ominaisresistanssi",null,25,"ohm/km",null,null,null,null,null,null,null,null,null,null,null,null,null,null,"Kaapelin ominaisresistanssi",null,25,"ohm/km"]
[null,null,null,null,null,null,null,null,null,null,null,null,null,null,null,null,null,null,null,null,null,null,null,"Kaapelivastus/silmukka",null,{"$f":"((Z309*Z311)/1000)","v":2.5000000000000001E-2},"ohm",null,null,null,null,null,null,null,null,null,null,null,null,null,null,"Kaapelivastus/silmukka",null,{"$f":"((AR309*AR311)/1000)","v":2.5000000000000001E-2},"ohm"]
[null,null,null,null,null,null,null,null,null,null,null,null,null,null,null,null,null,null,null,null,null,null,null,"Kaapelin pituus",null,{"$f":"E148","v":1},"m",null,null,null,null,null,null,null,null,null,null,null,null,null,null,"Kaapelin pituus",null,{"$f":"F148","v":1},"m"]
[null,null,null,null,null,null,null,null,null,null,null,null,null,null,null,null,null,null,null,null,null,null,null,"Kuormitus",null,{"$f":"E150/1000","v":0},"A",null,null,null,null,null,null,null,null,null,null,null,null,null,null,"Kuormitus",null,{"$f":"(F150/1000)","v":0},"A"]
[]
[]
[null,null,null,null,null,null,null,null,null,null,null,null,null,null,null,null,null,null,null,null,null,null,"R1",{"$f":"(Z310/10/2)","v":1.25E-3},null,null,null,null,null,null,null,null,null,null,null,null,null,null,null,null,"R1",{"$f":"(AR310/10/2)","v":1.25E-3}]
[null,null,null,null,null,null,null,null,null,null,null,null,null,null,null,null,null,null,null,null,null,null,"R2",{"$f":"(31/(Z312/10))","v":{"$error":"#DIV/0!"}},null,{"$f":"(X315+X316+X317)","v":{"$error":"#DIV/0!"}},{"$f":"(-X316)","v":{"$error":"#DIV/0!"}},0,0,0,0,0,0,0,0,null,40,null,null,null,"R2",{"$f":"(31/(AR312/10))","v":{"$error":"#DIV/0!"}},null,{"$f":"(AP315+AP316+AP317)","v":{"$error":"#DIV/0!"}},{"$f":"(-AP316)","v":{"$error":"#DIV/0!"}},0,0,0,0,0,0,0,0,null,40]
[null,null,null,null,null,null,null,null,null,null,null,null,null,null,null,null,null,null,null,null,null,null,"R3",{"$f":"(Z310/10/2)","v":1.25E-3},null,{"$f":"(-X316)","v":{"$error":"#DIV/0!"}},{"$f":"(X318+X319+X320+X316)","v":{"$error":"#DIV/0!"}},{"$f":"(-X319)","v":{"$error":"#DIV/0!"}},0,0,0,0,0,0,0,null,0,null,null,null,"R3",{"$f":"(AR310/10/2)","v":1.25E-3},null,{"$f":"(-AP316)","v":{"$error":"#DIV/0!"}},{"$f":"(AP318+AP319+AP320+AP316)","v":{"$error":"#DIV/0!"}},{"$f":"(-AP319)","v":{"$error":"#DIV/0!"}},0,0,0,0,0,0,0,null,0]
[null,null,null,null,null,null,null,null,null,null,null,null,null,null,null,null,null,null,null,null,null,null,"R4",{"$f":"(Z310/10/2)","v":1.25E-3},null,0,{"$f":"(-X319)","v":{"$error":"#DIV/0!"}},{"$f":"(X321+X322+X323+X319)","v":{"$error":"#DIV/0!"}},{"$f":"(-X322)","v":{"$error":"#DIV/0!"}},0,0,0,0,0,0,null,0,null,null,null,"R4",{"$f":"(AR310/10/2)","v":1.25E-3},null,0,{"$f":"(-AP319)","v":{"$error":"#DIV/0!"}},{"$f":"(AP321+AP322+AP323+AP319)","v":{"$error":"#DIV/0!"}},{"$f":"(-AP322)","v":{"$error":"#DIV/0!"}},0,0,0,0,0,0,null,0]
[null,null,null,null,null,null,null,null,null,null,null,null,null,null,null,null,null,null,null,null,null,null,"R5",{"$f":"(31/(Z312/10))","v":{"$error":"#DIV/0!"}},null,0,0,{"$f":"(-X322)","v":{"$error":"#DIV/0!"}},{"$f":"(X324+X325+X326+X322)","v":{"$error":"#DIV/0!"}},{"$f":"(-X325)","v":{"$error":"#DIV/0!"}},0,0,0,0,0,null,0,null,null,null,"R5",{"$f":"(31/(AR312/10))","v":{"$error":"#DIV/0!"}},null,0,0,{"$f":"(-AP322)","v":{"$error":"#DIV/0!"}},{"$f":"(AP324+AP325+AP326+AP322)","v":{"$error":"#DIV/0!"}},{"$f":"(-AP325)","v":{"$error":"#DIV/0!"}},0,0,0,0,0,null,0]
[null,null,null,null,null,null,null,null,null,null,null,null,null,null,null,null,null,null,null,null,null,null,"R6",{"$f":"(Z310/10/2)","v":1.25E-3},null,0,0,0,{"$f":"(-X325)","v":{"$error":"#DIV/0!"}},{"$f":"(X327+X328+X329+X325)","v":{"$error":"#DIV/0!"}},{"$f":"(-X328)","v":{"$error":"#DIV/0!"}},0,0,0,0,null,0,null,null,null,"R6",{"$f":"(AR310/10/2)","v":1.25E-3},null,0,0,0,{"$f":"(-AP325)","v":{"$error":"#DIV/0!"}},{"$f":"(AP327+AP328+AP329+AP325)","v":{"$error":"#DIV/0!"}},{"$f":"(-AP328)","v":{"$error":"#DIV/0!"}},0,0,0,0,null,0]
[null,null,null,null,null,null,null,null,null,null,null,null,null,null,null,null,null,null,null,null,null,null,"R7",{"$f":"(Z310/10/2)","v":1.25E-3},null,0,0,0,0,{"$f":"(-X328)","v":{"$error":"#DIV/0!"}},{"$f":"(X330+X331+X332+X328)","v":{"$error":"#DIV/0!"}},{"$f":"(-X331)","v":{"$error":"#DIV/0!"}},0,0,0,null,0,null,null,null,"R7",{"$f":"(AR310/10/2)","v":1.25E-3},null,0,0,0,0,{"$f":"(-AP328)","v":{"$error":"#DIV/0!"}},{"$f":"(AP330+AP331+AP332+AP328)","v":{"$error":"#DIV/0!"}},{"$f":"(-AP331)","v":{"$error":"#DIV/0!"}},0,0,0,null,0]
[null,null,null,null,null,null,null,null,null,null,null,null,null,null,null,null,null,null,null,null,null,null,"R8",{"$f":"(31/(Z312/10))","v":{"$error":"#DIV/0!"}},null,0,0,0,0,0,{"$f":"(-X331)","v":{"$error":"#DIV/0!"}},{"$f":"(X330+X331+X332+X328)","v":{"$error":"#DIV/0!"}},{"$f":"(-X334)","v":{"$error":"#DIV/0!"}},0,0,null,0,null,null,null,"R8",{"$f":"(31/(AR312/10))","v":{"$error":"#DIV/0!"}},null,0,0,0,0,0,{"$f":"(-AP331)","v":{"$error":"#DIV/0!"}},{"$f":"(AP330+AP331+AP332+AP328)","v":{"$error":"#DIV/0!"}},{"$f":"(-AP334)","v":{"$error":"#DIV/0!"}},0,0,null,0]
[null,null,null,null,null,null,null,null,null,null,null,null,null,null,null,null,null,null,null,null,null,null,"R9",{"$f":"(Z310/10/2)","v":1.25E-3},null,0,0,0,0,0,0,{"$f":"(-X334)","v":{"$error":"#DIV/0!"}},{"$f":"(X336+X337+X338+X334)","v":{"$error":"#DIV/0!"}},{"$f":"(-X337)","v":{"$error":"#DIV/0!"}},0,null,0,null,null,null,"R9",{"$f":"(AR310/10/2)","v":1.25E-3},null,0,0,0,0,0,0,{"$f":"(-AP334)","v":{"$error":"#DIV/0!"}},{"$f":"(AP336+AP337+AP338+AP334)","v":{"$error":"#DIV/0!"}},{"$f":"(-AP337)","v":{"$error":"#DIV/0!"}},0,null,0]
[null,null,null,null,null,null,null,null,null,null,null,null,null,null,null,null,null,null,null,null,null,null,"R10",{"$f":"(Z310/10/2)","v":1.25E-3},null,0,0,0,0,0,0,0,{"$f":"(-X337)","v":{"$error":"#DIV/0!"}},{"$f":"(X339+X340+X341+X337)","v":{"$error":"#DIV/0!"}},{"$f":"(-X340)","v":{"$error":"#DIV/0!"}},null,0,null,null,null,"R10",{"$f":"(AR310/10/2)","v":1.25E-3},null,0,0,0,0,0,0,0,{"$f":"(-AP337)","v":{"$error":"#DIV/0!"}},{"$f":"(AP339+AP340+AP341+AP337)","v":{"$error":"#DIV/0!"}},{"$f":"(-AP340)","v":{"$error":"#DIV/0!"}},null,0]
[null,null,null,null,null,null,null,null,null,null,null,null,null,null,null,null,null,null,null,null,null,null,"R11",{"$f":"(31/(Z312/10))","v":{"$error":"#DIV/0!"}},null,0,0,0,0,0,0,0,0,{"$f":"(-X340)","v":{"$error":"#DIV/0!"}},{"$f":"(X342+X343+X344+X340)","v":{"$error":"#DIV/0!"}},null,0,null,null,null,"R11",{"$f":"(31/(AR312/10))","v":{"$error":"#DIV/0!"}},null,0,0,0,0,0,0,0,0,{"$f":"(-AP340)","v":{"$error":"#DIV/0!"}},{"$f":"(AP342+AP343+AP344+AP340)","v":{"$error":"#DIV/0!"}},null,0]
[null,null,null,null,null,null,null,null,null,null,null,null,null,null,null,null,null,null,null,null,null,null,"R12",{"$f":"(Z310/10/2)","v":1.25E-3},null,null,null,null,null,null,null,null,null,null,null,null,null,null,null,null,"R12",{"$f":"(AR310/10/2)","v":1.25E-3}]
[null,null,null,null,null,null,null,null,null,null,null,null,null,null,null,null,null,null,null,null,null,null,"R13",{"$f":"(Z310/10/2)","v":1.25E-3},null,null,null,null,null,null,null,null,null,null,null,null,null,null,null,null,"R13",{"$f":"(AR310/10/2)","v":1.25E-3}]
[null,null,null,null,null,null,null,null,null,null,null,null,null,null,null,null,null,null,null,null,null,null,"R14",{"$f":"(31/(Z312/10))","v":{"$error":"#DIV/0!"}},null,{"$f":"MINVERSE(Z316:AI325)","v":{"$error":"#DIV/0!"}},null,null,null,null,null,null,null,null,null,null,{"$f":"MMULT(_xlfn.ANCHORARRAY(Z328),AK316:AK325)","v":{"$error":"#DIV/0!"}},null,null,null,"R14",{"$f":"(31/(AR312/10))","v":{"$error":"#DIV/0!"}},null,{"$f":"MINVERSE(AR316:BA325)","v":{"$error":"#DIV/0!"}},null,null,null,null,null,null,null,null,null,null,{"$f":"MMULT(_xlfn.ANCHORARRAY(AR328),BC316:BC325)","v":{"$error":"#DIV/0!"}}]
[null,null,null,null,null,null,null,null,null,null,null,null,null,null,null,null,null,null,null,null,null,null,"R15",{"$f":"(Z310/10/2)","v":1.25E-3},null,null,null,null,null,null,null,null,null,null,null,null,null,null,null,null,"R15",{"$f":"(AR310/10/2)","v":1.25E-3}]
[null,null,null,null,null,null,null,null,null,null,null,null,null,null,null,null,null,null,null,null,null,null,"R16",{"$f":"(Z310/10/2)","v":1.25E-3},null,null,null,null,null,null,null,null,null,null,null,null,null,null,null,null,"R16",{"$f":"(AR310/10/2)","v":1.25E-3}]
[null,null,null,null,null,null,null,null,null,null,null,null,null,null,null,null,null,null,null,null,null,null,"R17",{"$f":"(31/(Z312/10))","v":{"$error":"#DIV/0!"}},null,null,null,null,null,null,null,null,null,null,null,null,null,null,null,null,"R17",{"$f":"(31/(AR312/10))","v":{"$error":"#DIV/0!"}}]
[null,null,null,null,null,null,null,null,null,null,null,null,null,null,null,null,null,null,null,null,null,null,"R18",{"$f":"(Z310/10/2)","v":1.25E-3},null,null,null,null,null,null,null,null,null,null,null,null,null,null,null,null,"R18",{"$f":"(AR310/10/2)","v":1.25E-3}]
[null,null,null,null,null,null,null,null,null,null,null,null,null,null,null,null,null,null,null,null,null,null,"R19",{"$f":"(Z310/10/2)","v":1.25E-3},null,null,null,null,null,null,null,null,null,null,null,null,null,null,null,null,"R19",{"$f":"(AR310/10/2)","v":1.25E-3}]
[null,null,null,null,null,null,null,null,null,null,null,null,null,null,null,null,null,null,null,null,null,null,"R20",{"$f":"(31/(Z312/10))","v":{"$error":"#DIV/0!"}},null,null,null,null,null,null,null,null,null,null,null,null,null,null,null,null,"R20",{"$f":"(31/(AR312/10))","v":{"$error":"#DIV/0!"}}]
[null,null,null,null,null,null,null,null,null,null,null,null,null,null,null,null,null,null,null,null,null,null,"R21",{"$f":"(Z310/10/2)","v":1.25E-3},null,null,null,null,null,null,null,null,null,null,null,null,null,null,null,null,"R21",{"$f":"(AR310/10/2)","v":1.25E-3}]
[null,null,null,null,null,null,null,null,null,null,null,null,null,null,null,null,null,null,null,null,null,null,"R22",{"$f":"(Z310/10/2)","v":1.25E-3},null,null,null,null,null,null,null,null,null,null,null,null,null,null,null,null,"R22",{"$f":"(AR310/10/2)","v":1.25E-3}]
[null,null,null,null,null,null,null,null,null,null,null,null,null,null,null,null,null,null,null,null,null,null,"R23",{"$f":"(31/(Z312/10))","v":{"$error":"#DIV/0!"}},null,null,null,null,null,null,null,null,null,null,null,null,null,null,null,null,"R23",{"$f":"(31/(AR312/10))","v":{"$error":"#DIV/0!"}}]
[null,null,null,null,null,null,null,null,null,null,null,null,null,null,null,null,null,null,null,null,null,null,"R24",{"$f":"(Z310/10/2)","v":1.25E-3},null,null,null,null,null,null,null,null,null,null,null,null,null,null,null,null,"R24",{"$f":"(AR310/10/2)","v":1.25E-3}]
[null,null,null,null,null,null,null,null,null,null,null,null,null,null,null,null,null,null,null,null,null,null,"R25",{"$f":"(Z310/10/2)","v":1.25E-3},null,null,null,null,null,null,null,null,null,null,null,null,null,"UR30",{"$f":"(X343*AK337)","v":{"$error":"#DIV/0!"}},null,"R25",{"$f":"(AR310/10/2)","v":1.25E-3},null,null,null,null,null,null,null,null,null,null,null,null,null,"UR30",{"$f":"(AP343*BC337)","v":{"$error":"#DIV/0!"}}]
[null,null,null,null,null,null,null,null,null,null,null,null,null,null,null,null,null,null,null,null,null,null,"R26",{"$f":"(31/(Z312/10))","v":{"$error":"#DIV/0!"}},null,null,null,null,null,null,null,null,null,null,null,null,null,null,null,null,"R26",{"$f":"(31/(AR312/10))","v":{"$error":"#DIV/0!"}}]
[null,null,null,null,null,null,null,null,null,null,null,null,null,null,null,null,null,null,null,null,null,null,"R27",{"$f":"(Z310/10/2)","v":1.25E-3},null,null,null,null,null,null,null,null,null,null,null,null,null,null,null,null,"R27",{"$f":"(AR310/10/2)","v":1.25E-3}]
[null,null,null,null,null,null,null,null,null,null,null,null,null,null,null,null,null,null,null,null,null,null,"R28",{"$f":"(Z310/10/2)","v":1.25E-3},null,null,null,null,null,null,null,null,null,null,null,null,null,null,null,null,"R28",{"$f":"(AR310/10/2)","v":1.25E-3}]
[null,null,null,null,null,null,null,null,null,null,null,null,null,null,null,null,null,null,null,null,null,null,"R29",{"$f":"(31/(Z312/10))","v":{"$error":"#DIV/0!"}},null,null,null,null,null,null,null,null,null,null,null,null,null,null,null,null,"R29",{"$f":"(31/(AR312/10))","v":{"$error":"#DIV/0!"}}]
[null,null,null,null,null,null,null,null,null,null,null,null,null,null,null,null,null,null,null,null,null,null,"R30",{"$f":"(Z310/10/2)","v":1.25E-3},null,null,null,null,null,null,null,null,null,null,null,null,null,null,null,null,"R30",{"$f":"(AR310/10/2)","v":1.25E-3}]

{"sheet":"Neptolux ENG","index":2,"n_rows":344,"n_cols":57,"rows_kept":344,"cut":false,"hidden":false,"merged":[[5,9,5,11],[6,9,6,11],[7,9,7,11],[0,9,0,11],[1,9,1,11],[2,9,2,11],[3,9,3,11],[4,9,4,11],[14,4,14,5],[14,6,14,7],[28,9,29,16],[30,9,31,16],[25,9,26,16]]}
["Calculator for load and cable legth",null,null,null,null,null,null,null,"Project:"]
[{"$f":"'Neptolux FIN'!A2","v":"v 1.1"}]
["Nepto 3K",null,null,null,null,null,null,null,"Date:"]
[null,"Lepo",null,null,"Amount","Consumption, mA"]
["Nepto 3K",60,null,null,1,{"$f":"E5*B5","v":60},null,null,"Version:"]
["Line card (line 2)",15,null,null,0,{"$f":"E6*B6","v":0}]
["Network card (HedRing.net)",40,null,null,0,0,null,null,"Number:"]
["NL-KLG",60,null,null,0,0]
[]
["Total:",null,null,null,null,{"$f":"SUM(F5:F9)","v":60}]
[]
[]
[null,null,null,null,null,null,null,null,null,null,null,null,null,null,null,null,null,null,"Maximum load calculator"]
[]
["Emergency lights","Lepo","Lataus/vikaledi",null,"Line 1",null,"Line 2",null,null,"Manual",null,null,null,null,null,null,null,null,"Neptolux- devices",null,null,null,"Line 1",null,null,null,"Line 2"]
[null,null,"päällä",null,"Amount","Current, mA","Amount","Current, mA",null,null,null,null,null,null,null,null,null,null,null,"I, [mA]","NU","P, [W]","Amount","NU","Power, W","Current, mA","Amount","NU","Power, W","Current, mA"]
["N68-C/ N68-O (0) FACTORY SETTING",7.8,0.4,null,0,{"$f":"(B17*E17)","v":0},0,{"$f":"(B17*G17)","v":0},null,"Using this calculator, one can determine:",null,null,null,null,null,null,null,null,"N68-C/N68-O 24h, Default power",{"$f":"B17","v":7.8},4.8,0.04,{"$f":"(E17-W18-W19-W20)","v":0},{"$f":"(W17*U17)","v":0},{"$f":"(W17*0.25)","v":0},".",{"$f":"(G17-AA18-AA19-AA20)","v":0},{"$f":"(AA17*Y17)","v":0},{"$f":"(AA17*0.25)","v":0},{"$f":"(AA17*T17)","v":0}]
["N68-C/ N68-O (1)",11.04,0.4,null,0,{"$f":"(B18*E18)","v":0},0,0,null,"Nepto 3K- units current consumption",null,null,null,null,null,null,null,null,"N68-C/N68-O 12h, Default power",{"$f":"(T17+4.7)","v":12.5},{"$f":"(U17+2)","v":6.8},0.96,0,{"$f":"(W18*U18)","v":0},0,{"$f":"(W18*T18)","v":0},0,{"$f":"(AA18*Y18)","v":0},0,{"$f":"(AA18*T18)","v":0}]
["N68-C/ N68-O (2)",14.280000000000001,0.4,null,0,0,0,0,null,"Line load",null,null,null,null,null,null,null,null,"N68-C/N68-O 24h, Hi-Power",{"$f":"(T17+4.7)","v":12.5},{"$f":"(U17+2)","v":6.8},0.04,0,0,{"$f":"(W19*0.25)","v":0},0,0,0,{"$f":"(AA19*0.25)","v":0},{"$f":"(AA19*T19)","v":0}]
["N68-C/ N68-O (3)",17.52,0.4,null,0,0,0,0,null,"Lines maximum length",null,null,null,null,null,null,null,null,"N68-C/N68-O 12h, Hi-Power",{"$f":"(T17+21.7)","v":29.5},{"$f":"(U17+13)","v":17.8},0.96,0,0,{"$f":"(W20*0.25)","v":0},0,0,0,{"$f":"(AA20*0.25)","v":0},0]
["N68-C/ N68-O (4)",24,0.4,null,0,0,0,0,null,"Central bettery ",null,null,null,null,null,null,null,null,"N20, 24h charge time",{"$f":"B29","v":12.7},7.9,0.25,{"$f":"(E29-W22)","v":0},0,{"$f":"(W21*0.25)","v":0},0,{"$f":"(G29-AA22)","v":0},0,{"$f":"(AA21*0.25)","v":0},0]
["N68-C/ N68-O (5)",30.48,0.4,null,0,0,0,0,null,null,null,null,null,null,null,null,null,null,"N20, 12h charge time",{"$f":"(T21+4.7)","v":17.399999999999999},{"$f":"(U21+2)","v":9.9},0.25,0,0,{"$f":"(W22*0.25)","v":0},0,0,0,{"$f":"(AA22*0.25)","v":0},0]
["N68-C/ N68-O (6)",36.311999999999998,0.4,null,0,0,0,0,null,"1. Type the amount for central unit devices. ",null,null,null,null,null,null,null,null,"N40, 24h charge time",{"$f":"B37","v":20.399999999999999},12.6,0.53,{"$f":"(E37-W24)","v":0},0,{"$f":"(W23*0.53)","v":0},0,{"$f":"(G37-AA24)","v":0},0,{"$f":"(AA23*0.53)","v":0},0]
["N68-C/ N68-O (7) ACTIVE STATE",36.311999999999998,0.4,null,0,0,0,0,null,"2. Insert the amounts per line for different luminaires. Default brightness has been higlighted with a darker shade.",null,null,null,null,null,null,null,null,"N40, 12h charge time",{"$f":"(T23+4.7)","v":25.099999999999998},{"$f":"(U23+2)","v":14.6},0.53,0,0,{"$f":"(W24*0.53)","v":0},0,0,0,{"$f":"(AA24*0.53)","v":0},0]
["N20 / N20-X (0)",6.1,0.4,null,0,0,0,0,null,"3. The calculator will notify if tha maximum load or address number exceeds.",null,null,null,null,null,null,null,null,"N68-C-3/N68-O-3 24h, Default power",{"$f":"B41","v":22},13.6,0.04,{"$f":"(E41-W26-W27-W28)","v":0},0,{"$f":"(W25*0.25)","v":0},0,{"$f":"(G41-AA26-AA27-AA28)","v":0},0,{"$f":"(AA25*0.25)","v":0},0]
["N20 / N20-X (1)",7.333333333333333,0.4,null,0,0,0,0,null,"4. Type the estimated maximum length of each line to the cells at row 148. (Longest distance from central unit to furthest address)",null,null,null,null,null,null,null,null,"N68-C-3/N68-O-3 12h, Default power",{"$f":"(T25+17.1)","v":39.1},{"$f":"(U25+11)","v":24.6},0.96,0,0,0,0,0,0,0,0]
["N20 / N20-X (2)",8.5666666666666664,0.4,null,0,0,0,0,null,null,null,null,null,null,null,null,null,null,"N68-C-3/N68-O-3 24h, Hi-Power",{"$f":"(T25+4.7)","v":26.7},{"$f":"(U25+11)","v":24.6},0.04,0,0,0,0,0,0,0,0]
["N20 / N20-X (3)",9.8000000000000007,0.4,null,0,0,0,0,null,"5. The calculator uses the values typed in step 2 to determine weither the the load is not too high for the cable",null,null,null,null,null,null,null,null,"N68-C-3/N68-O-3 12h, Hi-Power",{"$f":"(T25+24.1)","v":46.1},{"$f":"(U25+15)","v":28.6},0.96,0,0,0,0,0,0,0,0]
["N20 / N20-X (4) FACTORY SETTING",12.7,0.4,null,0,0,0,0,null,"6. It's possible to use Hi-Power setting or fastcharge mode for the products. In that case the maximum charging load increases.",null,null,null,null,null,null,null,null,"N20-3, 24h charge time",{"$f":"B53","v":20.6},12.8,0.25,{"$f":"(E53-W30)","v":0},0,0,0,{"$f":"(G53-AA30)","v":0},0,0,0]
["N20 / N20-X (5)",15.350000000000001,0.4,null,0,0,0,0,null,null,null,null,null,null,null,null,null,null,"N20-3, 12h charge time",{"$f":"(T29+17.1)","v":37.700000000000003},{"$f":"(U29+11)","v":23.8},0.25,0,0,0,0,0,0,0,0]
["N20 / N20-X (6)",18.100000000000001,0.4,null,0,0,0,0,null,"Use the calculator on the right to determine the maximum load during charging. The calculator uses the inserted values in the cable lenght calculation. (active cells have been highlighted with darker orange)",null,null,null,null,null,null,null,null,"N40-3, 24h charge time",{"$f":"B61","v":28.106666666666662},19.3,0.53,{"$f":"(E61-W32)","v":0},0,0,0,{"$f":"(G53-AA32)","v":0},0,0,0]
["N20 / N20-X (7)",12.7,0.4,null,0,0,0,0,null,null,null,null,null,null,null,null,null,null,"N40-3, 12h charge time",{"$f":"(T31+17.1)","v":45.206666666666663},{"$f":"(U31+11)","v":30.3},0.53,0,0,0,0,0,0,0,0]
["N40 / N40-X (0)",6.1,0.4,null,0,0,0,0,null,null,null,null,null,null,null,null,null,null,"N55 24h, Default power",{"$f":"B81","v":6.1},3.8,0.04,{"$f":"(E81-W34-W35-W36)","v":0},0,0,0,{"$f":"(G81-AA34-AA35-AA36)","v":0},0,0,0]
["N40 / N40-X (1)",8.3879999999999999,0.4,null,0,0,0,0,null,"Central battery",null,null,null,null,null,null,null,null,"N55 12h, Default power",9.6999999999999993,{"$f":"(U33+2)","v":5.8},0.96,0,0,0,0,0,0,0,0]
["N40 / N40-X (2)",11.82,0.4,null,0,0,0,0,null,"1. In central battery systems, one must use the \"ACTIVE STATE\"- values for calculating the cable load.",null,null,null,null,null,null,null,null,"N55 24h, Hi-Power",13.8,{"$f":"(U33+2)","v":5.8},0.04,0,0,0,0,0,0,0,0]
["N40 / N40-X (3)",15.251999999999999,0.4,null,0,0,0,0,null,"2. Type in the amounts for emergency lights to \"ACTIVE STATE\" and exit lights to \"FACTORY SETTING\"",null,null,null,null,null,null,null,null,"N55 12h, Hi-Power",32,{"$f":"(U33+13)","v":16.8},0.96,0,0,0,0,0,0,0,0]
["N40 / N40-X (4) FACTORY SETTING",20.399999999999999,0.4,null,0,0,0,0,null,"3. For central battery system, the actual standby time must be determined",null,null,null,null,null,null,null,null,"N55-3 24h, Default power",{"$f":"B89","v":9.6999999999999993},6,0.04,{"$f":"(E89-W38-W39-W40)","v":0},0,0,0,{"$f":"(G89-AA38-AA39-AA40)","v":0},0,0,0]
["N40 / N40-X (5)",23.259999999999998,0.4,null,0,0,0,0,null,"4. Insert the values for \"Standby time\" and \"Chosen battery capacity\"",null,null,null,null,null,null,null,null,"N55-3 12h, Default power",28.3,{"$f":"(U37+11)","v":17},0.96,0,0,0,0,0,0,0,0]
["N40 / N40-X (6)",26.119999999999997,0.4,null,0,0,0,0,null,"5. The calculator points out if the battery capacity is good enough.",null,null,null,null,null,null,null,null,"N55-3 24h, Hi-Power",13.8,{"$f":"(U37+11)","v":17},0.04,0,0,0,0,0,0,0,0]
["N40 / N40-X (7)",20.399999999999999,0.4,null,0,0,0,0,null,null,null,null,null,null,null,null,null,null,"N55-3 12h, Hi-Power",32,{"$f":"(U37+15)","v":21},0.96,0,0,0,0,0,0,0,0]
["N68-C3/ N68-O3 (0) FACTORY SETTING",22,0.4,null,0,0,0,0,null,null,null,null,null,null,null,null,null,null,"N89-C/N89-O 24h, Default power",{"$f":"B97","v":16.5},10.199999999999999,0.08,{"$f":"(E97-W42)","v":0},0,0,0,{"$f":"(G97-AA42)","v":0},0,0,0]
["N68-C3/ N68-O3 (1)",25.24,0.4,null,0,0,0,0,null,null,null,null,null,null,null,null,null,null,"N89-C/N89-O 12h, Default power",{"$f":"(T41+11)","v":27.5},{"$f":"(U41+6.5)","v":16.7},6.82,0,0,0,0,0,0,0,0]
["N68-C3/ N68-O3 (2)",28.48,0.4,null,0,0,0,0,null,null,null,null,null,null,null,null,null,null,"N89-C-3/N89-O-3 24h, Default power",44.5,27.6,0.08,{"$f":"(E105-W44)","v":0},0,0,0,{"$f":"(G105-AA44)","v":0},0,0,0]
["N68-C3/ N68-O3 (3)",31.72,0.4,null,0,0,0,0,null,null,null,null,null,null,null,null,null,null,"N89-C-3/N89-O-3 12h, Default power",{"$f":"(T43+36)","v":80.5},{"$f":"(U43+22.5)","v":50.1},6.82,0,0,0,0,0,0,0,0]
["N68-C3/ N68-O3 (4)",38.200000000000003,0.4,null,0,0,0,0,null,null,null,null,null,null,null,null,null,null,"N40C, 24h charge time",{"$f":"B117","v":50.5},31.3,0.08,{"$f":"(E117-W46)","v":0},0,0,0,{"$f":"(G117-AA46)","v":0},0,0,0]
["N68-C3/ N68-O3 (5)",44.68,0.4,null,0,0,0,0,null,null,null,null,null,null,null,null,null,null,"N40C, 12h charge time",{"$f":"(T45+11)","v":61.5},{"$f":"(U45+6.5)","v":37.799999999999997},6.82,0,0,0,0,0,0,0,0]
["N68-C3/ N68-O3 (6)",50.512,0.4,null,0,0,0,0,null,null,null,null,null,null,null,null,null,null,"N40C-3, 24h charge time",78.5,{"$f":"(31.3+6.8)","v":38.1},0.08,{"$f":"(E125-W48)","v":0},0,0,0,{"$f":"(G125-AA48)","v":1},0,0.25,78.5]
["N68-C3/ N68-O3 (7) ACTIVE STATE",50.512,0.4,null,0,0,0,0,null,null,null,null,null,null,null,null,null,null,"N40C-3, 12h charge time",{"$f":"(78.5+36)","v":114.5},{"$f":"(48.7+22.5)","v":71.2},6.82,0,0,0,0,0,0,0,0]
["N20-3 / N20-X3 (0)",13.8,0.4,null,0,0,0,0,null,null,null,null,null,null,null,null,null,null,"N70, 24h charge time",{"$f":"B69","v":50.5},31.3,0.08,{"$f":"(E69-W50)","v":0},0,0,{"$f":"(W49*T49)","v":0},{"$f":"(G69-AA50)","v":0},0,0,0]
["N20-3 / N20-X3 (1)",15,0.4,null,0,0,0,0,null,null,null,null,null,null,null,null,null,null,"N70, 12h charge time",{"$f":"(50.5+11)","v":61.5},{"$f":"(31.3+6.8)","v":38.1},0.92,0,0,0,{"$f":"(W50*T50)","v":0},0,0,0,0]
["N20-3 / N20-X3 (2)",16.3,0.4,null,0,0,0,0,null,null,null,null,null,null,null,null,null,null,"N70-3, 24h charge time",{"$f":"B77","v":78.5},48.7,0.08,{"$f":"(E77-W52)","v":0},0,0,{"$f":"(W51*T51)","v":0},{"$f":"(G77-AA52)","v":0},0,0,0]
["N20-3 / N20-X3 (3)",17.5,0.4,null,0,0,0,0,null,null,null,null,null,null,null,null,null,null,"N70-3, 12h charge time",{"$f":"(78.5+36)","v":114.5},{"$f":"(48.7+22.5)","v":71.2},0.92,0,0,0,{"$f":"(W52*T52)","v":0},0,0,0,0]
["N20-3 / N20-X3 (4) FACTORY SETTING",20.6,0.4,null,0,0,0,0,null,null,null,null,null,null,null,null,null,null,"N-IO",{"$f":"B129","v":3.2},2,0.1,{"$f":"(W5)","v":0},0,0,0,{"$f":"(AA5)","v":0},0,0,{"$f":"(AA53*T53)","v":0}]
["N20-3 / N20-X3 (5)",23.1,0.4,null,0,0,0,0,null,null,null,null,null,null,null,null,null,null,null,null,null,null,"Max. 127",null,null,"Max. 2000","Max. 127",null,null,"Max. 2000"]
["N20-3 / N20-X3 (6)",26.1,0.4,null,0,0,0,0,null,null,null,null,null,null,null,null,null,null,"Total:",null,null,null,{"$f":"SUM(W17:W53)","v":0},{"$f":"SUM(X17:X53)","v":0},{"$f":"SUM(Y17:Y53)","v":0},{"$f":"SUM(Z17:Z54)","v":0},{"$f":"SUM(AA17:AA53)","v":1},{"$f":"SUM(AB17:AB53)","v":0},{"$f":"SUM(AC17:AC53)","v":0.25},{"$f":"SUM(AD17:AD53)","v":78.5}]
["N20-3 / N20-X3 (7)",20.6,0.4,null,0,0,0,0,null,null,null,null,null,null,null,null,null,null,null,null,null,null,{"$f":"(W55/127)","v":0},null,null,{"$f":"(Z55/2000)","v":0},{"$f":"(AA55/127)","v":7.874015748031496E-3},null,null,{"$f":"(AD55/2000)","v":3.925E-2}]
["N40-3 / N40-X3 (0)",13.806666666666665,0.4,null,0,0,0,0]
["N40-3 / N40-X3 (1)",16.094666666666665,0.4,null,0,0,0,0]
["N40-3 / N40-X3 (2)",19.526666666666664,0.4,null,0,0,0,0]
["N40-3 / N40-X3 (3)",22.958666666666666,0.4,null,0,0,0,0]
["N40-3 / N40-X3 (4) FACTORY SETTING",28.106666666666662,0.4,null,0,0,0,0]
["N40-3 / N40-X3 (5)",30.966666666666661,0.4,null,0,0,0,0]
["N40-3 / N40-X3 (6)",33.826666666666661,0.4,null,0,0,0,0]
["N40-3 / N40-X3 (7)",28.106666666666662,0.4,null,0,0,0,0]
["N70 / N70-X (0)",16.5,0.4,null,0,0,0,0]
["N70 / N70-X (1)",23.3,0.4,null,0,0,0,0]
["N70 / N70-X (2)",30.1,0.4,null,0,0,0,0]
["N70 / N70-X (3)",36.9,0.4,null,0,0,0,0]
["N70 / N70-X (4) FACTORY SETTING",50.5,0.4,null,0,0,0,0]
["N70 / N70-X (5)",57.3,0.4,null,0,0,0,0]
["N70 / N70-X (6)",70.900000000000006,0.4,null,0,0,0,0]
["N70 / N70-X (7)",43.7,0.4,null,0,0,0,0]
["N70-3 / N70-X-3 (0)",44.5,0.4,null,0,0,0,0]
["N70-3 / N70-X-3 (1)",51.3,0.4,null,0,0,0,0]
["N70-3 / N70-X-3 (2)",58.1,0.4,null,0,0,0,0]
["N70-3 / N70-X-3 (3)",64.900000000000006,0.4,null,0,0,0,0]
["N70-3 / N70-X-3 (4) FACTORY SETTING",78.5,0.4,null,0,0,0,0]
["N70-3 / N70-X-3 (5)",85.3,0.4,null,0,0,0,0]
["N70-3 / N70-X-3 (6)",98.9,0.4,null,0,0,0,0]
["N70-3 / N70-X-3 (7)",71.7,0.4,null,0,0,0,0]
["N55 (0) FACTORY SETTING",6.1,0.4,null,0,0,0,{"$f":"(B81*G81)","v":0}]
["N55 (1)",9.5,0.4,null,0,0,0,0]
["N55 (2)",12.9,0.4,null,0,0,0,0]
["N55 (3)",16.2,0.4,null,0,0,0,0]
["N55 (4)",23,0.4,null,0,0,0,0]
["N55 (5)",29.8,0.4,null,0,0,0,0]
["N55 (6)",35.799999999999997,0.4,null,0,0,0,0]
["N55 (7) ACTIVE STATE",35.799999999999997,0.4,null,0,0,0,0]
["N55-3 (0) FACTORY SETTING",9.6999999999999993,0.4,null,0,0,0,0]
["N55-3 (1)",13.1,0.4,null,0,0,0,0]
["N55-3 (2)",16.5,0.4,null,0,0,0,0]
["N55-3 (3)",19.8,0.4,null,0,0,0,0]
["N55-3 (4)",26.6,0.4,null,0,0,0,0]
["N55-3 (5)",33.4,0.4,null,0,0,0,0]
["N55-3 (6)",39.5,0.4,null,0,0,0,0]
["N55-3 (7) ACTIVE STATE",39.5,0.4,null,0,0,0,0]
["N89-C/N89-O (0) FACTORY SETTING",16.5,0.4,null,0,0,0,0]
["N89-C/N89-O (1)",30.1,0.4,null,0,{"$f":"(B98*E98)","v":0},0,0]
["N89-C/N89-O (2)",36.9,0.4,null,0,0,0,0]
["N89-C/N89-O (3)",43.7,0.4,null,0,0,0,0]
["N89-C/N89-O (4)",50.5,0.4,null,0,0,0,0]
["N89-C/N89-O (5)",64.099999999999994,0.4,null,0,0,0,0]
["N89-C/N89-O (6) ACTIVE STATE",152.5,0.4,null,0,0,0,0]
["N89-C/N89-O (7)",234.1,0.4,null,0,0,0,0]
["N89-C3/N89-O3 (0) FACTORY SETTING",44.5,0.4,null,0,0,0,0]
["N89-C3/N89-O3 (1)",58.1,0.4,null,0,0,0,0]
["N89-C3/N89-O3 (2)",64.900000000000006,0.4,null,0,0,0,0]
["N89-C3/N89-O3 (3)",71.7,0.4,null,0,0,0,0]
["N89-C3/N89-O3 (4)",78.5,0.4,null,0,0,0,0]
["N89-C3/N89-O3 (5)",92.1,0.4,null,0,0,0,0]
["N89-C3/N89-O3 (6) ACTIVE STATE",180.5,0.4,null,0,0,0,0]
["N89-C3/N89-O3 (7)",262.10000000000002,0.4,null,0,0,0,0]
["N40C/N40C (0)",16.5,0.4,null,0,0,0,0]
["N40C/N40C (1)",30.1,0.4,null,0,0,0,0]
["N40C/N40C (2)",36.9,0.4,null,0,0,0,0]
["N40C/N40C (3)",43.7,0.4,null,0,0,0,0]
["N40C/N40C (4) FACTORY SETTING",50.5,0.4,null,0,0,0,0]
["N40C/N40C (5)",64.099999999999994,0.4,null,0,0,0,0]
["N40C/N40C (6)",70.900000000000006,0.4,null,0,0,0,0]
["N40C/N40C (7) ACTIVE STATE",234.1,0.4,null,0,0,0,0]
["N40C-3/N40C-3 (0)",44.5,0.4,null,0,0,0,0]
["N40C-3/N40C-3 (1)",58.1,0.4,null,0,0,0,0]
["N40C-3/N40C-3 (2)",64.900000000000006,0.4,null,0,0,0,0]
["N40C-3/N40C-3 (3)",71.7,0.4,null,0,0,0,0]
["N40C-3/N40C-3 (4) FACTORY SETTING",78.5,0.4,null,0,0,1,78.5]
["N40C-3/N40C-3 (5)",92.1,0.4,null,0,0,0,0]
["N40C-3/N40C-3 (6)",98.9,0.4,null,0,0,0,0]
["N40C-3/N40C-3 (7) ACTIVE STATE",262.10000000000002,0.4,null,0,0,0,0]
["N-IO",3.2,null,null,0,0,0,0]
[]
[null,null,null,null,"Amount","Amount","Amount","Amount"]
["Total:",null,null,null,{"$f":"SUM(E17:E129)","v":0},{"$f":"SUM(F17:F129)","v":0},{"$f":"SUM(G17:G129)","v":1},{"$f":"SUM(H17:H129)","v":78.5}]
[null,null,null,null,{"$f":"IF(E132<128,\"Ok\",\"Fault\")","v":"Ok"},{"$f":"IF(F132<2000,\"Ok\",\"Fault\")","v":"Ok"},{"$f":"IF(G132<128,\"Ok\",\"Fault\")","v":"Ok"},{"$f":"IF(H132<2000,\"Ok\",\"Fault\")","v":"Ok"},null,"Central battery calculation"]
[null,null,null,null,null,null,null,null,null,"Needed battery capacity",null,null,{"$f":"((F143*M136*2)/1000)","v":0.27700000000000002},"Ah"]
["Consumption",null,null,null,"Amount","Current",null,"Max. Load"]
[null,null,null,null,"pcs","(mA)",null,"Charge (mA)",null,"Standby time",null,null,1,"hours"]
["Central unit:",null,null,null,null,{"$f":"F10","v":60},null,"-"]
["Line 1",null,null,null,{"$f":"E132","v":0},{"$f":"(F132)","v":0},null,{"$f":"(Z55)","v":0}]
["Line 2",null,null,null,{"$f":"G132","v":1},{"$f":"H132","v":78.5},null,{"$f":"(AD55)","v":78.5},null,"Chosen battery capacity",null,{"$f":"IF(M139>M134,\"OK\",\"Ei voida ladata\")","v":"OK"},14,"Ah"]
[]
[null,null,null,null,null,null,null,null,null,"Actual standby time",null,null,{"$f":"(M139*1000)/(F143*2)","v":50.541516245487365},"h"]
[null,null,null,null,"kpl","(mA)"]
["Yhteensä:",null,null,null,{"$f":"SUM(E138:E142)","v":1},{"$f":"SUM(F137:F142)","v":138.5}]
[]
[]
[]
[null,null,null,null,"Line 1","Line 2"]
["Line lenght [m] (max. 1000m)",null,null,null,1,1]
[null,null,null,null,{"$f":"IF(E148<=1000,\"OK\",\"TOO LONG\")","v":"OK"},{"$f":"IF(F148<=1000,\"OK\",\"TOO LONG\")","v":"OK"}]
["Max current [mA]",null,null,null,{"$f":"IF(F138<H138,H138,F138)","v":0},{"$f":"IF(F139<H139,H139,F139)","v":78.5}]
[null,null,0.7,"yF"]
[null,null,0.7,"mH"]
[]
[]
["Osoitteet silmukassa tasavälein"]
["KLMA 2x0.8 74 ohm / km",null,null,null,{"$f":"IF(LOOKUP(E148,#REF!,#REF!)>E150,\"OK\",\"EI OK\")","v":{"$error":"#REF!"}},{"$f":"IF(LOOKUP(F148,#REF!,#REF!)>F150,\"OK\",\"EI OK\")","v":{"$error":"#REF!"}},{"$f":"IF(LOOKUP(G148,#REF!,#REF!)>G150,\"OK\",\"EI OK\")","v":{"$error":"#REF!"}},{"$f":"IF(LOOKUP(H148,#REF!,#REF!)>H150,\"OK\",\"EI OK\")","v":{"$error":"#REF!"}}]
["KLMA 4x0.8 37 ohm / km",null,null,null,{"$f":"IF(LOOKUP(E148,#REF!,#REF!)>E150,\"OK\",\"EI OK\")","v":{"$error":"#REF!"}},{"$f":"IF(LOOKUP(F148,#REF!,#REF!)>F150,\"OK\",\"EI OK\")","v":{"$error":"#REF!"}},{"$f":"IF(LOOKUP(G148,#REF!,#REF!)>G150,\"OK\",\"EI OK\")","v":{"$error":"#REF!"}},{"$f":"IF(LOOKUP(H148,#REF!,#REF!)>H150,\"OK\",\"EI OK\")","v":{"$error":"#REF!"}}]
["KLMA 2kpl 4x0.8 18,5 ohm / km",null,null,null,{"$f":"IF(LOOKUP(E148,#REF!,#REF!)>E150,\"OK\",\"EI OK\")","v":{"$error":"#REF!"}},{"$f":"IF(LOOKUP(F148,#REF!,#REF!)>F150,\"OK\",\"EI OK\")","v":{"$error":"#REF!"}},{"$f":"IF(LOOKUP(G148,#REF!,#REF!)>G150,\"OK\",\"EI OK\")","v":{"$error":"#REF!"}},{"$f":"IF(LOOKUP(H148,#REF!,#REF!)>H150,\"OK\",\"EI OK\")","v":{"$error":"#REF!"}}]
[]
["Addresses with even distances among the line"]
["KLMA 2x0.8 74 ohm / km",null,null,null,{"$f":"IF(AM225>=25,\"OK\",\"TOO LONG\")","v":{"$error":"#DIV/0!"}},{"$f":"IF(BE225>=25,\"OK\",\"TOO LONG\")","v":"OK"}]
["KLMA 4x0.8 37 ohm / km",null,null,null,{"$f":"IF(AM263>=25,\"OK\",\"TOO LONG\")","v":{"$error":"#DIV/0!"}},{"$f":"IF(BE263>=25,\"OK\",\"TOO LONG\")","v":"OK"}]
["ELQYB 2x1,0 50 ohm / km",null,null,null,{"$f":"IF(AM301>=25,\"OK\",\"TOO LONG\")","v":{"$error":"#DIV/0!"}},{"$f":"IF(BE301>=25,\"OK\",\"TOO LONG\")","v":"OK"}]
["ELQYB 4x1,0 25 ohm / km",null,null,null,{"$f":"IF(AM339>=25,\"OK\",\"TOO LONG\")","v":{"$error":"#DIV/0!"}},{"$f":"IF(BE339>=25,\"OK\",\"TOO LONG\")","v":"OK"}]
["KLM 2x1,0 50 ohm / km",null,null,null,{"$f":"IF(AM301>=25,\"OK\",\"TOO LONG\")","v":{"$error":"#DIV/0!"}},{"$f":"IF(BE301>=25,\"OK\",\"TOO LONG\")","v":"OK"}]
["KLM 4x1,0 25 ohm / km",null,null,null,{"$f":"IF(AM339>=25,\"OK\",\"TOO LONG\")","v":{"$error":"#DIV/0!"}},{"$f":"IF(BE339>=25,\"OK\",\"TOO LONG\")","v":"OK"}]
["Osoitteet silmukan päässä",null,null,null,{"$f":"IF(AM342>=25,\"OK\",\"TOO LONG\")","v":"TOO LONG"},{"$f":"IF(BE342>=25,\"OK\",\"TOO LONG\")","v":"TOO LONG"}]
["KLMA 2x0.8 74 ohm / km",null,null,null,"TOO LONG","TOO LONG",{"$f":"IF(LOOKUP(G148,#REF!,#REF!)>G150,\"OK\",\"EI OK\")","v":{"$error":"#REF!"}},{"$f":"IF(LOOKUP(H148,#REF!,#REF!)>H150,\"OK\",\"EI OK\")","v":{"$error":"#REF!"}}]
["KLMA 4x0.8 37 ohm / km",null,null,null,"TOO LONG","TOO LONG",{"$f":"IF(LOOKUP(G148,#REF!,#REF!)>G150,\"OK\",\"EI OK\")","v":{"$error":"#REF!"}},{"$f":"IF(LOOKUP(H148,#REF!,#REF!)>H150,\"OK\",\"EI OK\")","v":{"$error":"#REF!"}}]
["KLMA 2kpl 4x0.8 18,5 ohm / km",null,null,null,"TOO LONG","TOO LONG",{"$f":"IF(LOOKUP(G148,#REF!,#REF!)>G150,\"OK\",\"EI OK\")","v":{"$error":"#REF!"}},{"$f":"IF(LOOKUP(H148,#REF!,#REF!)>H150,\"OK\",\"EI OK\")","v":{"$error":"#REF!"}}]
[]
["Osoitteet linjan päässä"]
["KLMA 2x0.8 74 ohm / km",null,null,null,{"$f":"IF(G227<=15,\"OK\",\"TOO LONG\")","v":"OK"},{"$f":"IF(H227<=15,\"OK\",\"TOO LONG\")","v":"OK"}]
["KLMA 4x0.8 37 ohm / km",null,null,null,{"$f":"IF(G228<=15,\"OK\",\"TOO LONG\")","v":"OK"},"OK"]
["ELQYB 2x1,0 50 ohm / km",null,null,null,"OK","OK"]
["ELQYB 4x1,0 25 ohm / km",null,null,null,"OK","OK"]
["KLM 2x1,0 50 ohm / km",null,null,null,{"$f":"IF(G229<=15,\"OK\",\"TOO LONG\")","v":"OK"},{"$f":"IF(H229<=15,\"OK\",\"TOO LONG\")","v":"OK"}]
["KLM 4x1,0 25 ohm / km",null,null,null,{"$f":"IF(G230<=15,\"OK\",\"TOO LONG\")","v":"OK"},{"$f":"IF(H230<=15,\"OK\",\"TOO LONG\")","v":"OK"}]
[]
[]
[]
["Loop cabling equal distance"]
[null,null,null,null,"jännite 25V-40V","N89 28V-40V"]
[null,null,null,null,"KLM sama, kuin ELQYB",null,"ELQYB 4x1.0\n25 ohm/km",null,"ELQYB 2x1.0\n50 ohms/km",null,"KLMA 4x0.8\n37 ohm/km",null,"KLMA 2x0.8\n74 ohm/km",null,"[m]",null,"metrit"]
[null,null,null,null,null,null,"I, [mA]","I, [mA]","I, [mA]","I, [mA]","I, [mA]","I, [mA]","I, [mA]","I, [mA]"]
[null,null,null,null,null,null,{"$f":"((15/(2*25*Q186*0.001))*1000)","v":6000},{"$f":"((15/(2*25*P186*0.001))*1000)","v":300},{"$f":"((15/(2*50*Q186*0.001))*1000)","v":3000},{"$f":"((15/(2*50*P186*0.001))*1000)","v":150},{"$f":"((15/(2*37*Q186*0.001))*1000)","v":4054.0540540540537},{"$f":"((15/(2*37*P186*0.001))*1000)","v":202.70270270270271},{"$f":"((15/(2*74*Q186*0.001))*1000)","v":2027.0270270270269},{"$f":"((15/(2*74*P186*0.001))*1000)","v":101.35135135135135},0,1000,50]
[null,null,null,null,null,null,3000,{"$f":"((15/(2*25*P187*0.001))*1000)","v":333.33333333333331},1500,{"$f":"((15/(2*50*P187*0.001))*1000)","v":166.66666666666666},2027.0270270270269,{"$f":"((15/(2*37*P187*0.001))*1000)","v":225.22522522522524},1013.5135135135134,{"$f":"((15/(2*74*P187*0.001))*1000)","v":112.61261261261262},280,900,100]
[null,null,null,null,null,null,1500,375,750,187.5,1013.5135135135134,253.37837837837836,506.75675675675672,126.68918918918918,500,800,200]
[null,null,null,null,null,null,1000,428.57142857142856,500,214.28571428571428,675.67567567567562,289.57528957528956,337.83783783783781,144.78764478764478,1000,700,300]
[null,null,null,null,null,null,750,500,375,250,506.75675675675672,337.83783783783781,253.37837837837836,168.91891891891891,1500,600,400]
[null,null,null,null,null,null,600,600,300,300,405.40540540540542,405.40540540540542,202.70270270270271,202.70270270270271,2000,500,500]
[null,null,null,null,null,null,500,750,250,375,337.83783783783781,506.75675675675672,168.91891891891891,253.37837837837836,2001,400,600]
[null,null,null,null,null,null,428.57142857142856,1000,214.28571428571428,500,289.57528957528956,675.67567567567562,144.78764478764478,337.83783783783781,null,300,700]
[null,null,null,null,null,null,375,1500,187.5,750,253.37837837837836,1013.5135135135134,126.68918918918918,506.75675675675672,null,200,800]
[null,null,null,null,null,null,333.33333333333331,3000,166.66666666666666,1500,225.22522522522524,2027.0270270270269,112.61261261261262,1013.5135135135134,null,100,900,null,null,null,null,null,null,"Kaapelin ominaisresistanssi",null,74,"ohm/km",null,null,null,null,null,null,null,null,null,null,null,null,null,null,"Kaapelin ominaisresistanssi",null,74,"ohm/km"]
[null,null,null,null,null,null,{"$f":"((15/(2*25*Q196*0.001))*1000)","v":300},6000,{"$f":"((15/(2*50*Q196*0.001))*1000)","v":150},3000,{"$f":"((15/(2*37*Q196*0.001))*1000)","v":202.70270270270271},4054.0540540540537,{"$f":"((15/(2*74*Q196*0.001))*1000)","v":101.35135135135135},2027.0270270270269,null,50,1000,null,null,null,null,null,null,"Kaapelivastus/silmukka",null,{"$f":"((Z195*Z197)/1000)","v":7.3999999999999996E-2},"ohm",null,null,null,null,null,null,null,null,null,null,null,null,null,null,"Kaapelivastus/silmukka",null,{"$f":"((AR195*AR197)/1000)","v":7.3999999999999996E-2},"ohm"]
["Loop cabling worst case",null,null,null,null,null,null,null,null,null,null,null,null,null,null,null,null,null,null,null,null,null,null,"Kaapelin pituus",null,{"$f":"E148","v":1},"m",null,null,null,null,null,null,null,null,null,null,null,null,null,null,"Kaapelin pituus",null,{"$f":"F148","v":1},"m"]
[null,null,null,null,null,null,null,null,null,null,null,null,null,null,null,null,null,null,null,null,null,null,null,"Kuormitus",null,{"$f":"(E150/1000)","v":0},"A",null,null,null,null,null,null,null,null,null,null,null,null,null,null,"Kuormitus",null,{"$f":"(F150/1000)","v":7.85E-2},"A"]
[null,null,null,null,null,null,"ELQYB 4x1.0\n25 ohm/km",null,"ELQYB 2x1.0\n50 ohms/km",null,"KLMA 4x0.8\n37 ohm/km",null,"KLMA 2x0.8\n74 ohm/km",null,"[m]"]
[null,null,null,null,null,null,"I, [mA]","I, [mA]","I, [mA]","I, [mA]","I, [mA]","I, [mA]","I, [mA]"]
[null,null,null,null,null,null,1230,3000,635,3000,835,3000,415,3000,1000,0,null,null,null,null,null,null,"R1",{"$f":"(Z196/10/2)","v":3.6999999999999997E-3},null,null,null,null,null,null,null,null,null,null,null,null,null,null,null,null,"R1",{"$f":"(AR196/10/2)","v":3.6999999999999997E-3}]
[null,null,null,null,null,null,1370,3000,680,3000,925,3000,460,3000,900,100,null,null,null,null,null,1,"R2",{"$f":"(31/(Z198/10))","v":{"$error":"#DIV/0!"}},null,{"$f":"(X201+X202+X203)","v":{"$error":"#DIV/0!"}},{"$f":"(-X202)","v":{"$error":"#DIV/0!"}},0,0,0,0,0,0,0,0,null,40,null,null,null,"R2",{"$f":"(31/(AR198/10))","v":3949.0445859872616},null,{"$f":"(AP201+AP202+AP203)","v":3949.051985987262},{"$f":"(-AP202)","v":-3949.0445859872616},0,0,0,0,0,0,0,0,null,40]
[null,null,null,null,null,null,1540,3000,770,3000,1040,3000,520,2000,800,200,null,null,null,null,null,null,"R3",{"$f":"(Z196/10/2)","v":3.6999999999999997E-3},null,{"$f":"(-X202)","v":{"$error":"#DIV/0!"}},{"$f":"(X204+X205+X206+X202)","v":{"$error":"#DIV/0!"}},{"$f":"(-X205)","v":{"$error":"#DIV/0!"}},0,0,0,0,0,0,0,null,0,null,null,null,"R3",{"$f":"(AR196/10/2)","v":3.6999999999999997E-3},null,{"$f":"(-AP202)","v":-3949.0445859872616},{"$f":"(AP204+AP205+AP206+AP202)","v":7898.0965719745236},{"$f":"(-AP205)","v":-3949.0445859872616},0,0,0,0,0,0,0,null,0]
[null,null,null,null,null,null,1765,3000,880,2000,1190,3000,595,1350,700,300,null,null,null,null,null,null,"R4",{"$f":"(Z196/10/2)","v":3.6999999999999997E-3},null,0,{"$f":"(-X205)","v":{"$error":"#DIV/0!"}},{"$f":"(X207+X208+X209+X205)","v":{"$error":"#DIV/0!"}},{"$f":"(-X208)","v":{"$error":"#DIV/0!"}},0,0,0,0,0,0,null,0,null,null,null,"R4",{"$f":"(AR196/10/2)","v":3.6999999999999997E-3},null,0,{"$f":"(-AP205)","v":-3949.0445859872616},{"$f":"(AP207+AP208+AP209+AP205)","v":7898.0965719745236},{"$f":"(-AP208)","v":-3949.0445859872616},0,0,0,0,0,0,null,0]
[null,null,null,null,null,null,2000,3000,1030,1540,1380,2000,695,1040,600,400,null,null,null,null,null,2,"R5",{"$f":"(31/(Z198/10))","v":{"$error":"#DIV/0!"}},null,0,0,{"$f":"(-X208)","v":{"$error":"#DIV/0!"}},{"$f":"(X210+X211+X212+X208)","v":{"$error":"#DIV/0!"}},{"$f":"(-X211)","v":{"$error":"#DIV/0!"}},0,0,0,0,0,null,0,null,null,null,"R5",{"$f":"(31/(AR198/10))","v":3949.0445859872616},null,0,0,{"$f":"(-AP208)","v":-3949.0445859872616},{"$f":"(AP210+AP211+AP212+AP208)","v":7898.0965719745236},{"$f":"(-AP211)","v":-3949.0445859872616},0,0,0,0,0,null,0]
[null,null,null,null,null,null,2000,3000,1235,1235,1670,1670,835,835,500,500,null,null,null,null,null,null,"R6",{"$f":"(Z196/10/2)","v":3.6999999999999997E-3},null,0,0,0,{"$f":"(-X211)","v":{"$error":"#DIV/0!"}},{"$f":"(X213+X214+X215+X211)","v":{"$error":"#DIV/0!"}},{"$f":"(-X214)","v":{"$error":"#DIV/0!"}},0,0,0,0,null,0,null,null,null,"R6",{"$f":"(AR196/10/2)","v":3.6999999999999997E-3},null,0,0,0,{"$f":"(-AP211)","v":-3949.0445859872616},{"$f":"(AP213+AP214+AP215+AP211)","v":7898.0965719745236},{"$f":"(-AP214)","v":-3949.0445859872616},0,0,0,0,null,0]
[null,null,null,null,null,null,2000,2000,1540,1030,2000,1380,1040,695,400,600,null,null,null,null,null,null,"R7",{"$f":"(Z196/10/2)","v":3.6999999999999997E-3},null,0,0,0,0,{"$f":"(-X214)","v":{"$error":"#DIV/0!"}},{"$f":"(X216+X217+X218+X214)","v":{"$error":"#DIV/0!"}},{"$f":"(-X217)","v":{"$error":"#DIV/0!"}},0,0,0,null,0,null,null,null,"R7",{"$f":"(AR196/10/2)","v":3.6999999999999997E-3},null,0,0,0,0,{"$f":"(-AP214)","v":-3949.0445859872616},{"$f":"(AP216+AP217+AP218+AP214)","v":7898.0965719745236},{"$f":"(-AP217)","v":-3949.0445859872616},0,0,0,null,0]
[null,null,null,null,null,null,2000,1765,2000,880,2000,1190,1350,595,300,700,null,null,null,null,null,3,"R8",{"$f":"(31/(Z198/10))","v":{"$error":"#DIV/0!"}},null,0,0,0,0,0,{"$f":"(-X217)","v":{"$error":"#DIV/0!"}},{"$f":"(X216+X217+X218+X214)","v":{"$error":"#DIV/0!"}},{"$f":"(-X220)","v":{"$error":"#DIV/0!"}},0,0,null,0,null,null,null,"R8",{"$f":"(31/(AR198/10))","v":3949.0445859872616},null,0,0,0,0,0,{"$f":"(-AP217)","v":-3949.0445859872616},{"$f":"(AP216+AP217+AP218+AP214)","v":7898.0965719745236},{"$f":"(-AP220)","v":-3949.0445859872616},0,0,null,0]
[null,null,null,null,null,null,2000,1540,2000,770,2000,1040,2000,520,200,800,null,null,null,null,null,null,"R9",{"$f":"(Z196/10/2)","v":3.6999999999999997E-3},null,0,0,0,0,0,0,{"$f":"(-X220)","v":{"$error":"#DIV/0!"}},{"$f":"(X222+X223+X224+X220)","v":{"$error":"#DIV/0!"}},{"$f":"(-X223)","v":{"$error":"#DIV/0!"}},0,null,0,null,null,null,"R9",{"$f":"(AR196/10/2)","v":3.6999999999999997E-3},null,0,0,0,0,0,0,{"$f":"(-AP220)","v":-3949.0445859872616},{"$f":"(AP222+AP223+AP224+AP220)","v":7898.0965719745236},{"$f":"(-AP223)","v":-3949.0445859872616},0,null,0]
[null,null,null,null,null,null,2000,1370,2000,680,2000,925,2000,460,100,900,null,null,null,null,null,null,"R10",{"$f":"(Z196/10/2)","v":3.6999999999999997E-3},null,0,0,0,0,0,0,0,{"$f":"(-X223)","v":{"$error":"#DIV/0!"}},{"$f":"(X225+X226+X227+X223)","v":{"$error":"#DIV/0!"}},{"$f":"(-X226)","v":{"$error":"#DIV/0!"}},null,0,null,null,null,"R10",{"$f":"(AR196/10/2)","v":3.6999999999999997E-3},null,0,0,0,0,0,0,0,{"$f":"(-AP223)","v":-3949.0445859872616},{"$f":"(AP225+AP226+AP227+AP223)","v":7898.0965719745236},{"$f":"(-AP226)","v":-3949.0445859872616},null,0]
[null,null,null,null,null,null,2000,1230,2000,610,2000,835,2000,415,0,1000,null,null,null,null,null,4,"R11",{"$f":"(31/(Z198/10))","v":{"$error":"#DIV/0!"}},null,0,0,0,0,0,0,0,0,{"$f":"(-X226)","v":{"$error":"#DIV/0!"}},{"$f":"(X228+X229+X230+X226)","v":{"$error":"#DIV/0!"}},null,0,null,null,null,"R11",{"$f":"(31/(AR198/10))","v":3949.0445859872616},null,0,0,0,0,0,0,0,0,{"$f":"(-AP226)","v":-3949.0445859872616},{"$f":"(AP228+AP229+AP230+AP226)","v":7898.0965719745236},null,0]
[null,null,null,null,null,null,null,null,null,null,null,null,null,null,null,null,null,null,null,null,null,null,"R12",{"$f":"(Z196/10/2)","v":3.6999999999999997E-3},null,null,null,null,null,null,null,null,null,null,null,null,null,null,null,null,"R12",{"$f":"(AR196/10/2)","v":3.6999999999999997E-3}]
[null,null,null,null,null,null,null,null,null,null,null,null,null,null,null,null,null,null,null,null,null,null,"R13",{"$f":"(Z196/10/2)","v":3.6999999999999997E-3},null,null,null,null,null,null,null,null,null,null,null,null,null,null,null,null,"R13",{"$f":"(AR196/10/2)","v":3.6999999999999997E-3}]
[null,null,null,null,null,null,null,null,null,null,null,null,null,null,null,null,null,null,null,null,null,5,"R14",{"$f":"(31/(Z198/10))","v":{"$error":"#DIV/0!"}},null,{"$f":"MINVERSE(Z202:AI211)","v":{"$error":"#DIV/0!"}},null,null,null,null,null,null,null,null,null,null,{"$f":"MMULT(_xlfn.ANCHORARRAY(Z214),AK202:AK211)","v":{"$error":"#DIV/0!"}},null,null,null,"R14",{"$f":"(31/(AR198/10))","v":3949.0445859872616},null,{"$f":"MINVERSE(AR202:BA211)","v":2.532075392338452E-3},2.2788543306694045E-3,2.0256375392793285E-3,1.7724245436726281E-3,1.5192148693608232E-3,1.2660080418616555E-3,1.0128035866982024E-3,7.5960102939798713E-4,5.0639989549208775E-4,2.5319971051425064E-4,null,{"$f":"MMULT(_xlfn.ANCHORARRAY(AR214),BC202:BC211)","v":0.10128301569353808}]
[null,null,null,null,null,null,null,null,null,null,null,null,null,null,null,null,null,null,null,null,null,null,"R15",{"$f":"(Z196/10/2)","v":3.6999999999999997E-3},null,null,null,null,null,null,null,null,null,null,null,null,null,null,null,null,"R15",{"$f":"(AR196/10/2)","v":3.6999999999999997E-3},null,2.2788543306694053E-3,2.2788586009483748E-3,2.0256413350627049E-3,1.7724278649675232E-3,1.5192177161734608E-3,1.2660104141973703E-3,1.0128054845614397E-3,7.5960245279230328E-4,5.0640084442015007E-4,2.5320018497783722E-4,null,9.1154173226776214E-2]
[null,null,null,null,null,null,null,null,null,null,null,null,null,null,null,null,null,null,null,null,null,null,"R16",{"$f":"(Z196/10/2)","v":3.6999999999999997E-3},null,null,null,null,null,null,null,null,null,null,null,null,null,null,null,null,"R16",{"$f":"(AR196/10/2)","v":3.6999999999999997E-3},null,2.0256375392793289E-3,2.0256413350627045E-3,2.0256489266365701E-3,1.772434507563537E-3,1.5192234098040706E-3,1.2660151588732452E-3,1.0128092802914705E-3,7.5960529958360283E-4,5.0640274227805281E-4,2.5320113390589949E-4,null,8.1025501571173164E-2]
[null,null,null,null,null,null,null,null,null,null,null,null,null,null,null,null,null,null,null,null,null,6,"R17",{"$f":"(31/(Z198/10))","v":{"$error":"#DIV/0!"}},null,null,null,null,null,null,null,null,null,null,null,null,null,null,null,null,"R17",{"$f":"(31/(AR198/10))","v":3949.0445859872616},null,1.7724245436726285E-3,1.7724278649675232E-3,1.7724345075635372E-3,1.772444471473117E-3,1.5192319502633216E-3,1.2660222758981712E-3,1.0128149738954076E-3,7.5960956977722026E-4,5.0640558906935235E-4,2.5320255730021564E-4,null,7.0896981746905147E-2]
[null,null,null,null,null,null,null,null,null,null,null,null,null,null,null,null,null,null,null,null,null,null,"R18",{"$f":"(Z196/10/2)","v":3.6999999999999997E-3},null,null,null,null,null,null,null,null,null,null,null,null,null,null,null,null,"R18",{"$f":"(AR196/10/2)","v":3.6999999999999997E-3},null,1.5192148693608232E-3,1.5192177161734604E-3,1.5192234098040703E-3,1.5192319502633214E-3,1.5192433375672177E-3,1.2660317652854844E-3,1.0128225653839203E-3,7.5961526338115743E-4,5.064093847993832E-4,2.5320445516345286E-4,null,6.076859477443293E-2]
[null,null,null,null,null,null,null,null,null,null,null,null,null,null,null,null,null,null,null,null,null,null,"R19",{"$f":"(Z196/10/2)","v":3.6999999999999997E-3},null,null,null,null,null,null,null,null,null,null,null,null,null,null,null,null,"R19",{"$f":"(AR196/10/2)","v":3.6999999999999997E-3},null,1.2660080418616555E-3,1.2660104141973699E-3,1.266015158873245E-3,1.2660222758981707E-3,1.2660317652854842E-3,1.2660436270529672E-3,1.0128320547712337E-3,7.5962238040608331E-4,5.0641412947525805E-4,2.5320682749916756E-4,null,5.0640321674466221E-2]
[null,null,null,null,null,null,null,null,null,null,null,null,null,null,null,null,null,null,null,null,null,7,"R20",{"$f":"(31/(Z198/10))","v":{"$error":"#DIV/0!"}},null,null,null,null,null,null,null,null,null,null,null,null,null,null,null,null,"R20",{"$f":"(31/(AR198/10))","v":3949.0445859872616},null,1.0128035866982027E-3,1.0128054845614397E-3,1.0128092802914707E-3,1.0128149738954078E-3,1.0128225653839203E-3,1.012832054771234E-3,1.01284344207513E-3,7.5963092086533447E-4,5.0641982310586789E-4,2.5320967431180519E-4,null,4.0512143467928106E-2]
[null,null,null,null,null,null,null,null,null,null,null,null,null,null,null,null,null,null,null,null,null,null,"R21",{"$f":"(Z196/10/2)","v":3.6999999999999997E-3},null,null,null,null,null,null,null,null,null,null,null,null,null,null,null,null,"R21",{"$f":"(AR196/10/2)","v":3.6999999999999997E-3},null,7.5960102939798702E-4,7.5960245279230296E-4,7.5960529958360272E-4,7.5960956977722015E-4,7.5961526338115721E-4,7.5962238040608331E-4,7.5963092086533436E-4,7.5964088477491448E-4,5.0642646570188171E-4,2.5321299560670027E-4,null,3.0384041175919481E-2]
[null,null,null,null,null,null,null,null,null,null,null,null,null,null,null,null,null,null,null,null,null,null,"R22",{"$f":"(Z196/10/2)","v":3.6999999999999997E-3},null,null,null,null,null,null,null,null,null,null,null,null,null,null,null,null,"R22",{"$f":"(AR196/10/2)","v":3.6999999999999997E-3},null,5.0639989549208764E-4,5.0640084442014975E-4,5.0640274227805259E-4,5.0640558906935214E-4,5.0640938479938299E-4,5.0641412947525794E-4,5.0641982310586768E-4,5.0642646570188161E-4,5.0643405727574702E-4,2.5321679139007653E-4,null,2.0255995819683507E-2]
[null,null,null,null,null,null,null,null,null,null,null,null,null,null,null,null,null,null,null,null,null,8,"R23",{"$f":"(31/(Z198/10))","v":{"$error":"#DIV/0!"}},null,null,null,null,null,null,null,null,null,null,null,null,null,null,null,null,"R23",{"$f":"(31/(AR198/10))","v":3949.0445859872616},null,2.5319971051425053E-4,2.5320018497783706E-4,2.5320113390589938E-4,2.5320255730021553E-4,2.5320445516345276E-4,2.5320682749916751E-4,2.5320967431180513E-4,2.5321299560670022E-4,2.5321679139007653E-4,2.5322106166904675E-4,null,1.0127988420570021E-2]
[null,null,null,null,null,null,null,null,null,null,null,null,null,null,null,null,null,null,null,null,null,null,"R24",{"$f":"(Z196/10/2)","v":3.6999999999999997E-3},null,null,null,null,null,null,null,null,null,null,null,null,null,null,null,null,"R24",{"$f":"(AR196/10/2)","v":3.6999999999999997E-3}]
[null,null,null,null,null,null,null,null,null,null,null,null,null,null,null,null,null,null,null,null,null,null,"R25",{"$f":"(Z196/10/2)","v":3.6999999999999997E-3},null,null,null,null,null,null,null,null,null,null,null,null,null,"UR30",{"$f":"(X229*AK223)","v":{"$error":"#DIV/0!"}},null,"R25",{"$f":"(AR196/10/2)","v":3.6999999999999997E-3},null,null,null,null,null,null,null,null,null,null,null,null,null,"UR30",{"$f":"(AP229*BC223)","v":39.995877839193717}]
[null,null,null,null,null,null,"Worst case jännitehäviö",null,null,null,null,null,null,null,null,null,null,null,null,null,null,9,"R26",{"$f":"(31/(Z198/10))","v":{"$error":"#DIV/0!"}},null,null,null,null,null,null,null,null,null,null,null,null,null,null,null,null,"R26",{"$f":"(31/(AR198/10))","v":3949.0445859872616}]
["KLMA 2x0.8 74 ohm / km",null,null,null,null,null,{"$f":"((E150/1000)*2*74*(E148/1000))","v":0},{"$f":"((F150/1000)*2*74*(F148/1000))","v":1.1618E-2},null,null,null,null,null,null,null,null,null,null,null,null,null,null,"R27",{"$f":"(Z196/10/2)","v":3.6999999999999997E-3},null,null,null,null,null,null,null,null,null,null,null,null,null,null,null,null,"R27",{"$f":"(AR196/10/2)","v":3.6999999999999997E-3}]
["KLMA 4x0.8 37 ohm / km",null,null,null,null,null,{"$f":"((E150/1000)*2*37*(E148/1000))","v":0},{"$f":"((F150/1000)*2*37*(F148/1000))","v":5.8089999999999999E-3},null,null,null,null,null,null,null,null,null,null,null,null,null,null,"R28",{"$f":"(Z196/10/2)","v":3.6999999999999997E-3},null,null,null,null,null,null,null,null,null,null,null,null,null,null,null,null,"R28",{"$f":"(AR196/10/2)","v":3.6999999999999997E-3}]
["ELQYB 2x1,0 50 ohm / km",null,null,null,null,null,{"$f":"((E150/1000)*2*50*(E148/1000))","v":0},{"$f":"((F150/1000)*2*50*(F148/1000))","v":7.8499999999999993E-3},null,null,null,null,null,null,null,null,null,null,null,null,null,10,"R29",{"$f":"(31/(Z198/10))","v":{"$error":"#DIV/0!"}},null,null,null,null,null,null,null,null,null,null,null,null,null,null,null,null,"R29",{"$f":"(31/(AR198/10))","v":3949.0445859872616}]
["ELQYB 4x1,0 25 ohm / km",null,null,null,null,null,{"$f":"((E150/1000)*2*25*(E148/1000))","v":0},{"$f":"((F150/1000)*2*25*(F148/1000))","v":3.9249999999999997E-3},null,null,null,null,null,null,null,null,null,null,null,null,null,null,"R30",{"$f":"(Z196/10/2)","v":3.6999999999999997E-3},null,null,null,null,null,null,null,null,null,null,null,null,null,null,null,null,"R30",{"$f":"(AR196/10/2)","v":3.6999999999999997E-3}]
[]
[]
[null,null,null,null,null,null,null,null,null,null,null,null,null,null,null,null,null,null,null,null,null,null,null,"Kaapelin ominaisresistanssi",null,37,"ohm/km",null,null,null,null,null,null,null,null,null,null,null,null,null,null,"Kaapelin ominaisresistanssi",null,37,"ohm/km"]
[null,null,null,null,null,null,null,null,null,null,null,null,null,null,null,null,null,null,null,null,null,null,null,"Kaapelivastus/silmukka",null,{"$f":"((Z233*Z235)/1000)","v":3.6999999999999998E-2},"ohm",null,null,null,null,null,null,null,null,null,null,null,null,null,null,"Kaapelivastus/silmukka",null,{"$f":"((AR233*AR235)/1000)","v":3.6999999999999998E-2},"ohm"]
[null,null,null,null,null,null,null,null,null,null,null,null,null,null,null,null,null,null,null,null,null,null,null,"Kaapelin pituus",null,{"$f":"E148","v":1},"m",null,null,null,null,null,null,null,null,null,null,null,null,null,null,"Kaapelin pituus",null,{"$f":"F148","v":1},"m"]
[null,null,null,null,null,null,null,null,null,null,null,null,null,null,null,null,null,null,null,null,null,null,null,"Kuormitus",null,{"$f":"(E150/1000)","v":0},"A",null,null,null,null,null,null,null,null,null,null,null,null,null,null,"Kuormitus",null,{"$f":"(F150/1000)","v":7.85E-2},"A"]
[]
[]
[null,null,null,null,null,null,null,null,null,null,null,null,null,null,null,null,null,null,null,null,null,null,"R1",{"$f":"(Z234/10/2)","v":1.8499999999999999E-3},null,null,null,null,null,null,null,null,null,null,null,null,null,null,null,null,"R1",{"$f":"(AR234/10/2)","v":1.8499999999999999E-3}]
[null,null,null,null,null,null,null,null,null,null,null,null,null,null,null,null,null,null,null,null,null,null,"R2",{"$f":"(31/(Z236/10))","v":{"$error":"#DIV/0!"}},null,{"$f":"(X239+X240+X241)","v":{"$error":"#DIV/0!"}},{"$f":"(-X240)","v":{"$error":"#DIV/0!"}},0,0,0,0,0,0,0,0,null,40,null,null,null,"R2",{"$f":"(31/(AR236/10))","v":3949.0445859872616},null,{"$f":"(AP239+AP240+AP241)","v":3949.0482859872618},{"$f":"(-AP240)","v":-3949.0445859872616},0,0,0,0,0,0,0,0,null,40]
[null,null,null,null,null,null,null,null,null,null,null,null,null,null,null,null,null,null,null,null,null,null,"R3",{"$f":"(Z234/10/2)","v":1.8499999999999999E-3},null,{"$f":"(-X240)","v":{"$error":"#DIV/0!"}},{"$f":"(X242+X243+X244+X240)","v":{"$error":"#DIV/0!"}},{"$f":"(-X243)","v":{"$error":"#DIV/0!"}},0,0,0,0,0,0,0,null,0,null,null,null,"R3",{"$f":"(AR234/10/2)","v":1.8499999999999999E-3},null,{"$f":"(-AP240)","v":-3949.0445859872616},{"$f":"(AP242+AP243+AP244+AP240)","v":7898.0928719745234},{"$f":"(-AP243)","v":-3949.0445859872616},0,0,0,0,0,0,0,null,0]
[null,null,null,null,null,null,null,null,null,null,null,null,null,null,null,null,null,null,null,null,null,null,"R4",{"$f":"(Z234/10/2)","v":1.8499999999999999E-3},null,0,{"$f":"(-X243)","v":{"$error":"#DIV/0!"}},{"$f":"(X245+X246+X247+X243)","v":{"$error":"#DIV/0!"}},{"$f":"(-X246)","v":{"$error":"#DIV/0!"}},0,0,0,0,0,0,null,0,null,null,null,"R4",{"$f":"(AR234/10/2)","v":1.8499999999999999E-3},null,0,{"$f":"(-AP243)","v":-3949.0445859872616},{"$f":"(AP245+AP246+AP247+AP243)","v":7898.0928719745234},{"$f":"(-AP246)","v":-3949.0445859872616},0,0,0,0,0,0,null,0]
[null,null,null,null,null,null,null,null,null,null,null,null,null,null,null,null,null,null,null,null,null,null,"R5",{"$f":"(31/(Z236/10))","v":{"$error":"#DIV/0!"}},null,0,0,{"$f":"(-X246)","v":{"$error":"#DIV/0!"}},{"$f":"(X248+X249+X250+X246)","v":{"$error":"#DIV/0!"}},{"$f":"(-X249)","v":{"$error":"#DIV/0!"}},0,0,0,0,0,null,0,null,null,null,"R5",{"$f":"(31/(AR236/10))","v":3949.0445859872616},null,0,0,{"$f":"(-AP246)","v":-3949.0445859872616},{"$f":"(AP248+AP249+AP250+AP246)","v":7898.0928719745234},{"$f":"(-AP249)","v":-3949.0445859872616},0,0,0,0,0,null,0]
[null,null,null,null,null,null,null,null,null,null,null,null,null,null,null,null,null,null,null,null,null,null,"R6",{"$f":"(Z234/10/2)","v":1.8499999999999999E-3},null,0,0,0,{"$f":"(-X249)","v":{"$error":"#DIV/0!"}},{"$f":"(X251+X252+X253+X249)","v":{"$error":"#DIV/0!"}},{"$f":"(-X252)","v":{"$error":"#DIV/0!"}},0,0,0,0,null,0,null,null,null,"R6",{"$f":"(AR234/10/2)","v":1.8499999999999999E-3},null,0,0,0,{"$f":"(-AP249)","v":-3949.0445859872616},{"$f":"(AP251+AP252+AP253+AP249)","v":7898.0928719745234},{"$f":"(-AP252)","v":-3949.0445859872616},0,0,0,0,null,0]
[null,null,null,null,null,null,null,null,null,null,null,null,null,null,null,null,null,null,null,null,null,null,"R7",{"$f":"(Z234/10/2)","v":1.8499999999999999E-3},null,0,0,0,0,{"$f":"(-X252)","v":{"$error":"#DIV/0!"}},{"$f":"(X254+X255+X256+X252)","v":{"$error":"#DIV/0!"}},{"$f":"(-X255)","v":{"$error":"#DIV/0!"}},0,0,0,null,0,null,null,null,"R7",{"$f":"(AR234/10/2)","v":1.8499999999999999E-3},null,0,0,0,0,{"$f":"(-AP252)","v":-3949.0445859872616},{"$f":"(AP254+AP255+AP256+AP252)","v":7898.0928719745234},{"$f":"(-AP255)","v":-3949.0445859872616},0,0,0,null,0]
[null,null,null,null,null,null,null,null,null,null,null,null,null,null,null,null,null,null,null,null,null,null,"R8",{"$f":"(31/(Z236/10))","v":{"$error":"#DIV/0!"}},null,0,0,0,0,0,{"$f":"(-X255)","v":{"$error":"#DIV/0!"}},{"$f":"(X254+X255+X256+X252)","v":{"$error":"#DIV/0!"}},{"$f":"(-X258)","v":{"$error":"#DIV/0!"}},0,0,null,0,null,null,null,"R8",{"$f":"(31/(AR236/10))","v":3949.0445859872616},null,0,0,0,0,0,{"$f":"(-AP255)","v":-3949.0445859872616},{"$f":"(AP254+AP255+AP256+AP252)","v":7898.0928719745234},{"$f":"(-AP258)","v":-3949.0445859872616},0,0,null,0]
[null,null,null,null,null,null,null,null,null,null,null,null,null,null,null,null,null,null,null,null,null,null,"R9",{"$f":"(Z234/10/2)","v":1.8499999999999999E-3},null,0,0,0,0,0,0,{"$f":"(-X258)","v":{"$error":"#DIV/0!"}},{"$f":"(X260+X261+X262+X258)","v":{"$error":"#DIV/0!"}},{"$f":"(-X261)","v":{"$error":"#DIV/0!"}},0,null,0,null,null,null,"R9",{"$f":"(AR234/10/2)","v":1.8499999999999999E-3},null,0,0,0,0,0,0,{"$f":"(-AP258)","v":-3949.0445859872616},{"$f":"(AP260+AP261+AP262+AP258)","v":7898.0928719745234},{"$f":"(-AP261)","v":-3949.0445859872616},0,null,0]
[null,null,null,null,null,null,null,null,null,null,null,null,null,null,null,null,null,null,null,null,null,null,"R10",{"$f":"(Z234/10/2)","v":1.8499999999999999E-3},null,0,0,0,0,0,0,0,{"$f":"(-X261)","v":{"$error":"#DIV/0!"}},{"$f":"(X263+X264+X265+X261)","v":{"$error":"#DIV/0!"}},{"$f":"(-X264)","v":{"$error":"#DIV/0!"}},null,0,null,null,null,"R10",{"$f":"(AR234/10/2)","v":1.8499999999999999E-3},null,0,0,0,0,0,0,0,{"$f":"(-AP261)","v":-3949.0445859872616},{"$f":"(AP263+AP264+AP265+AP261)","v":7898.0928719745234},{"$f":"(-AP264)","v":-3949.0445859872616},null,0]
[null,null,null,null,null,null,null,null,null,null,null,null,null,null,null,null,null,null,null,null,null,null,"R11",{"$f":"(31/(Z236/10))","v":{"$error":"#DIV/0!"}},null,0,0,0,0,0,0,0,0,{"$f":"(-X264)","v":{"$error":"#DIV/0!"}},{"$f":"(X266+X267+X268+X264)","v":{"$error":"#DIV/0!"}},null,0,null,null,null,"R11",{"$f":"(31/(AR236/10))","v":3949.0445859872616},null,0,0,0,0,0,0,0,0,{"$f":"(-AP264)","v":-3949.0445859872616},{"$f":"(AP266+AP267+AP268+AP264)","v":7898.0928719745234},null,0]
[null,null,null,null,null,null,null,null,null,null,null,null,null,null,null,null,null,null,null,null,null,null,"R12",{"$f":"(Z234/10/2)","v":1.8499999999999999E-3},null,null,null,null,null,null,null,null,null,null,null,null,null,null,null,null,"R12",{"$f":"(AR234/10/2)","v":1.8499999999999999E-3}]
[null,null,null,null,null,null,null,null,null,null,null,null,null,null,null,null,null,null,null,null,null,null,"R13",{"$f":"(Z234/10/2)","v":1.8499999999999999E-3},null,null,null,null,null,null,null,null,null,null,null,null,null,null,null,null,"R13",{"$f":"(AR234/10/2)","v":1.8499999999999999E-3}]
[null,null,null,null,null,null,null,null,null,null,null,null,null,null,null,null,null,null,null,null,null,null,"R14",{"$f":"(31/(Z236/10))","v":{"$error":"#DIV/0!"}},null,{"$f":"MINVERSE(Z240:AI249)","v":{"$error":"#DIV/0!"}},null,null,null,null,null,null,null,null,null,null,{"$f":"MMULT(_xlfn.ANCHORARRAY(Z252),AK240:AK249)","v":{"$error":"#DIV/0!"}},null,null,null,"R14",{"$f":"(31/(AR236/10))","v":3949.0445859872616},null,{"$f":"MINVERSE(AR240:BA249)","v":2.5321667246449905E-3},2.2789432906702334E-3,2.0257219919183112E-3,1.7725025911372043E-3,1.5192848510766691E-3,1.266068534488022E-3,1.0128534041239097E-3,7.5963922273809164E-4,5.0642575308521649E-4,2.5321275792059933E-4,null,{"$f":"MMULT(_xlfn.ANCHORARRAY(AR252),BC240:BC249)","v":0.10128666898579962}]
[null,null,null,null,null,null,null,null,null,null,null,null,null,null,null,null,null,null,null,null,null,null,"R15",{"$f":"(Z234/10/2)","v":1.8499999999999999E-3},null,null,null,null,null,null,null,null,null,null,null,null,null,null,null,null,"R15",{"$f":"(AR234/10/2)","v":1.8499999999999999E-3},null,2.2789432906702334E-3,2.2789454258930683E-3,2.025723889889126E-3,1.7725042518577773E-3,1.5192862745485563E-3,1.266069720712557E-3,1.012854353102204E-3,7.596399344710344E-4,5.0642622757347453E-4,2.5321299516461722E-4,null,9.1157731626809332E-2]
[null,null,null,null,null,null,null,null,null,null,null,null,null,null,null,null,null,null,null,null,null,null,"R16",{"$f":"(Z234/10/2)","v":1.8499999999999999E-3},null,null,null,null,null,null,null,null,null,null,null,null,null,null,null,null,"R16",{"$f":"(AR234/10/2)","v":1.8499999999999999E-3},null,2.0257219919183112E-3,2.025723889889126E-3,2.0257276858325342E-3,1.7725075733004793E-3,1.5192891214936644E-3,1.2660720931627386E-3,1.0128562510596819E-3,7.5964135793758682E-4,5.0642717655043513E-4,2.5321346965287525E-4,null,8.1028879676732446E-2]
[null,null,null,null,null,null,null,null,null,null,null,null,null,null,null,null,null,null,null,null,null,null,"R17",{"$f":"(31/(Z236/10))","v":{"$error":"#DIV/0!"}},null,null,null,null,null,null,null,null,null,null,null,null,null,null,null,null,"R17",{"$f":"(31/(AR236/10))","v":3949.0445859872616},null,1.7725025911372034E-3,1.7725042518577764E-3,1.7725075733004789E-3,1.7725125554684221E-3,1.5192933919146608E-3,1.2660756518407894E-3,1.0128590979981214E-3,7.5964349313908247E-4,5.0642860001698755E-4,2.5321418138581802E-4,null,7.0900103645488141E-2]
[null,null,null,null,null,null,null,null,null,null,null,null,null,null,null,null,null,null,null,null,null,null,"R18",{"$f":"(Z234/10/2)","v":1.8499999999999999E-3},null,null,null,null,null,null,null,null,null,null,null,null,null,null,null,null,"R18",{"$f":"(AR234/10/2)","v":1.8499999999999999E-3},null,1.5192848510766689E-3,1.5192862745485559E-3,1.5192891214936646E-3,1.519293391914661E-3,1.5192990858155465E-3,1.2660803967500438E-3,1.01286289392019E-3,7.5964634007752202E-4,5.0643049797446536E-4,2.5321513036411235E-4,null,6.0771394043066751E-2]
[null,null,null,null,null,null,null,null,null,null,null,null,null,null,null,null,null,null,null,null,null,null,"R19",{"$f":"(Z234/10/2)","v":1.8499999999999999E-3},null,null,null,null,null,null,null,null,null,null,null,null,null,null,null,null,"R19",{"$f":"(AR234/10/2)","v":1.8499999999999999E-3},null,1.2660685344880215E-3,1.2660697207125566E-3,1.2660720931627384E-3,1.2660756518407892E-3,1.2660803967500436E-3,1.2660863278949473E-3,1.0128676388294444E-3,7.5964989875557283E-4,5.0643287042464688E-4,2.532163165886474E-4,null,5.0642741379520864E-2]
[null,null,null,null,null,null,null,null,null,null,null,null,null,null,null,null,null,null,null,null,null,null,"R20",{"$f":"(31/(Z236/10))","v":{"$error":"#DIV/0!"}},null,null,null,null,null,null,null,null,null,null,null,null,null,null,null,null,"R20",{"$f":"(31/(AR236/10))","v":3949.0445859872616},null,1.0128534041239092E-3,1.0128543531022036E-3,1.0128562510596816E-3,1.0128590979981212E-3,1.01286289392019E-3,1.0128676388294444E-3,1.0128733327303301E-3,7.5965416917656925E-4,5.0643571736975492E-4,2.5321774006053458E-4,null,4.0514136164956367E-2]
[null,null,null,null,null,null,null,null,null,null,null,null,null,null,null,null,null,null,null,null,null,null,"R21",{"$f":"(Z234/10/2)","v":1.8499999999999999E-3},null,null,null,null,null,null,null,null,null,null,null,null,null,null,null,null,"R21",{"$f":"(AR234/10/2)","v":1.8499999999999999E-3},null,7.5963922273809142E-4,7.5963993447103419E-4,7.5964135793758672E-4,7.5964349313908236E-4,7.5964634007752213E-4,7.5964989875557283E-4,7.5965416917656925E-4,7.5965915134451232E-4,5.0643903881245696E-4,2.5321940078110758E-4,null,3.0385568909523656E-2]
[null,null,null,null,null,null,null,null,null,null,null,null,null,null,null,null,null,null,null,null,null,null,"R22",{"$f":"(Z234/10/2)","v":1.8499999999999999E-3},null,null,null,null,null,null,null,null,null,null,null,null,null,null,null,null,"R22",{"$f":"(AR234/10/2)","v":1.8499999999999999E-3},null,5.0642575308521628E-4,5.0642622757347431E-4,5.0642717655043502E-4,5.0642860001698744E-4,5.0643049797446536E-4,5.0643287042464677E-4,5.0643571736975492E-4,5.0643903881245696E-4,5.0644283475586487E-4,2.5322129875192238E-4,null,2.025703012340865E-2]
[null,null,null,null,null,null,null,null,null,null,null,null,null,null,null,null,null,null,null,null,null,null,"R23",{"$f":"(31/(Z236/10))","v":{"$error":"#DIV/0!"}},null,null,null,null,null,null,null,null,null,null,null,null,null,null,null,null,"R23",{"$f":"(31/(AR236/10))","v":3949.0445859872616},null,2.5321275792059922E-4,2.5321299516461711E-4,2.5321346965287515E-4,2.5321418138581796E-4,2.5321513036411235E-4,2.5321631658864734E-4,2.5321774006053453E-4,2.5321940078110758E-4,2.5322129875192238E-4,2.5322343397475729E-4,null,1.0128510316823968E-2]
[null,null,null,null,null,null,null,null,null,null,null,null,null,null,null,null,null,null,null,null,null,null,"R24",{"$f":"(Z234/10/2)","v":1.8499999999999999E-3},null,null,null,null,null,null,null,null,null,null,null,null,null,null,null,null,"R24",{"$f":"(AR234/10/2)","v":1.8499999999999999E-3}]
[null,null,null,null,null,null,null,null,null,null,null,null,null,null,null,null,null,null,null,null,null,null,"R25",{"$f":"(Z234/10/2)","v":1.8499999999999999E-3},null,null,null,null,null,null,null,null,null,null,null,null,null,"UR30",{"$f":"(X267*AK261)","v":{"$error":"#DIV/0!"}},null,"R25",{"$f":"(AR234/10/2)","v":1.8499999999999999E-3},null,null,null,null,null,null,null,null,null,null,null,null,null,"UR30",{"$f":"(AP267*BC261)","v":39.997938830769819}]
[null,null,null,null,null,null,null,null,null,null,null,null,null,null,null,null,null,null,null,null,null,null,"R26",{"$f":"(31/(Z236/10))","v":{"$error":"#DIV/0!"}},null,null,null,null,null,null,null,null,null,null,null,null,null,null,null,null,"R26",{"$f":"(31/(AR236/10))","v":3949.0445859872616}]
[null,null,null,null,null,null,null,null,null,null,null,null,null,null,null,null,null,null,null,null,null,null,"R27",{"$f":"(Z234/10/2)","v":1.8499999999999999E-3},null,null,null,null,null,null,null,null,null,null,null,null,null,null,null,null,"R27",{"$f":"(AR234/10/2)","v":1.8499999999999999E-3}]
[null,null,null,null,null,null,null,null,null,null,null,null,null,null,null,null,null,null,null,null,null,null,"R28",{"$f":"(Z234/10/2)","v":1.8499999999999999E-3},null,null,null,null,null,null,null,null,null,null,null,null,null,null,null,null,"R28",{"$f":"(AR234/10/2)","v":1.8499999999999999E-3}]
[null,null,null,null,null,null,null,null,null,null,null,null,null,null,null,null,null,null,null,null,null,null,"R29",{"$f":"(31/(Z236/10))","v":{"$error":"#DIV/0!"}},null,null,null,null,null,null,null,null,null,null,null,null,null,null,null,null,"R29",{"$f":"(31/(AR236/10))","v":3949.0445859872616}]
[null,null,null,null,null,null,null,null,null,null,null,null,null,null,null,null,null,null,null,null,null,null,"R30",{"$f":"(Z234/10/2)","v":1.8499999999999999E-3},null,null,null,null,null,null,null,null,null,null,null,null,null,null,null,null,"R30",{"$f":"(AR234/10/2)","v":1.8499999999999999E-3}]
[]
[]
[null,null,null,null,null,null,null,null,null,null,null,null,null,null,null,null,null,null,null,null,null,null,null,"Kaapelin ominaisresistanssi",null,50,"ohm/km",null,null,null,null,null,null,null,null,null,null,null,null,null,null,"Kaapelin ominaisresistanssi",null,50,"ohm/km"]
[null,null,null,null,null,null,null,null,null,null,null,null,null,null,null,null,null,null,null,null,null,null,null,"Kaapelivastus/silmukka",null,{"$f":"((Z271*Z273)/1000)","v":0.05},"ohm",null,null,null,null,null,null,null,null,null,null,null,null,null,null,"Kaapelivastus/silmukka",null,{"$f":"((AR271*AR273)/1000)","v":0.05},"ohm"]
[null,null,null,null,null,null,null,null,null,null,null,null,null,null,null,null,null,null,null,null,null,null,null,"Kaapelin pituus",null,{"$f":"E148","v":1},"m",null,null,null,null,null,null,null,null,null,null,null,null,null,null,"Kaapelin pituus",null,{"$f":"F148","v":1},"m"]
[null,null,null,null,null,null,null,null,null,null,null,null,null,null,null,null,null,null,null,null,null,null,null,"Kuormitus",null,{"$f":"E150/1000","v":0},"A",null,null,null,null,null,null,null,null,null,null,null,null,null,null,"Kuormitus",null,{"$f":"(F150/1000)","v":7.85E-2},"A"]
[]
[]
[null,null,null,null,null,null,null,null,null,null,null,null,null,null,null,null,null,null,null,null,null,null,"R1",{"$f":"(Z272/10/2)","v":2.5000000000000001E-3},null,null,null,null,null,null,null,null,null,null,null,null,null,null,null,null,"R1",{"$f":"(AR272/10/2)","v":2.5000000000000001E-3}]
[null,null,null,null,null,null,null,null,null,null,null,null,null,null,null,null,null,null,null,null,null,null,"R2",{"$f":"(31/(Z274/10))","v":{"$error":"#DIV/0!"}},null,{"$f":"(X277+X278+X279)","v":{"$error":"#DIV/0!"}},{"$f":"(-X278)","v":{"$error":"#DIV/0!"}},0,0,0,0,0,0,0,0,null,40,null,null,null,"R2",{"$f":"(31/(AR274/10))","v":3949.0445859872616},null,{"$f":"(AP277+AP278+AP279)","v":3949.0495859872617},{"$f":"(-AP278)","v":-3949.0445859872616},0,0,0,0,0,0,0,0,null,40]
[null,null,null,null,null,null,null,null,null,null,null,null,null,null,null,null,null,null,null,null,null,null,"R3",{"$f":"(Z272/10/2)","v":2.5000000000000001E-3},null,{"$f":"(-X278)","v":{"$error":"#DIV/0!"}},{"$f":"(X280+X281+X282+X278)","v":{"$error":"#DIV/0!"}},{"$f":"(-X281)","v":{"$error":"#DIV/0!"}},0,0,0,0,0,0,0,null,0,null,null,null,"R3",{"$f":"(AR272/10/2)","v":2.5000000000000001E-3},null,{"$f":"(-AP278)","v":-3949.0445859872616},{"$f":"(AP280+AP281+AP282+AP278)","v":7898.0941719745233},{"$f":"(-AP281)","v":-3949.0445859872616},0,0,0,0,0,0,0,null,0]
[null,null,null,null,null,null,null,null,null,null,null,null,null,null,null,null,null,null,null,null,null,null,"R4",{"$f":"(Z272/10/2)","v":2.5000000000000001E-3},null,0,{"$f":"(-X281)","v":{"$error":"#DIV/0!"}},{"$f":"(X283+X284+X285+X281)","v":{"$error":"#DIV/0!"}},{"$f":"(-X284)","v":{"$error":"#DIV/0!"}},0,0,0,0,0,0,null,0,null,null,null,"R4",{"$f":"(AR272/10/2)","v":2.5000000000000001E-3},null,0,{"$f":"(-AP281)","v":-3949.0445859872616},{"$f":"(AP283+AP284+AP285+AP281)","v":7898.0941719745233},{"$f":"(-AP284)","v":-3949.0445859872616},0,0,0,0,0,0,null,0]
[null,null,null,null,null,null,null,null,null,null,null,null,null,null,null,null,null,null,null,null,null,null,"R5",{"$f":"(31/(Z274/10))","v":{"$error":"#DIV/0!"}},null,0,0,{"$f":"(-X284)","v":{"$error":"#DIV/0!"}},{"$f":"(X286+X287+X288+X284)","v":{"$error":"#DIV/0!"}},{"$f":"(-X287)","v":{"$error":"#DIV/0!"}},0,0,0,0,0,null,0,null,null,null,"R5",{"$f":"(31/(AR274/10))","v":3949.0445859872616},null,0,0,{"$f":"(-AP284)","v":-3949.0445859872616},{"$f":"(AP286+AP287+AP288+AP284)","v":7898.0941719745233},{"$f":"(-AP287)","v":-3949.0445859872616},0,0,0,0,0,null,0]
[null,null,null,null,null,null,null,null,null,null,null,null,null,null,null,null,null,null,null,null,null,null,"R6",{"$f":"(Z272/10/2)","v":2.5000000000000001E-3},null,0,0,0,{"$f":"(-X287)","v":{"$error":"#DIV/0!"}},{"$f":"(X289+X290+X291+X287)","v":{"$error":"#DIV/0!"}},{"$f":"(-X290)","v":{"$error":"#DIV/0!"}},0,0,0,0,null,0,null,null,null,"R6",{"$f":"(AR272/10/2)","v":2.5000000000000001E-3},null,0,0,0,{"$f":"(-AP287)","v":-3949.0445859872616},{"$f":"(AP289+AP290+AP291+AP287)","v":7898.0941719745233},{"$f":"(-AP290)","v":-3949.0445859872616},0,0,0,0,null,0]
[null,null,null,null,null,null,null,null,null,null,null,null,null,null,null,null,null,null,null,null,null,null,"R7",{"$f":"(Z272/10/2)","v":2.5000000000000001E-3},null,0,0,0,0,{"$f":"(-X290)","v":{"$error":"#DIV/0!"}},{"$f":"(X292+X293+X294+X290)","v":{"$error":"#DIV/0!"}},{"$f":"(-X293)","v":{"$error":"#DIV/0!"}},0,0,0,null,0,null,null,null,"R7",{"$f":"(AR272/10/2)","v":2.5000000000000001E-3},null,0,0,0,0,{"$f":"(-AP290)","v":-3949.0445859872616},{"$f":"(AP292+AP293+AP294+AP290)","v":7898.0941719745233},{"$f":"(-AP293)","v":-3949.0445859872616},0,0,0,null,0]
[null,null,null,null,null,null,null,null,null,null,null,null,null,null,null,null,null,null,null,null,null,null,"R8",{"$f":"(31/(Z274/10))","v":{"$error":"#DIV/0!"}},null,0,0,0,0,0,{"$f":"(-X293)","v":{"$error":"#DIV/0!"}},{"$f":"(X292+X293+X294+X290)","v":{"$error":"#DIV/0!"}},{"$f":"(-X296)","v":{"$error":"#DIV/0!"}},0,0,null,0,null,null,null,"R8",{"$f":"(31/(AR274/10))","v":3949.0445859872616},null,0,0,0,0,0,{"$f":"(-AP293)","v":-3949.0445859872616},{"$f":"(AP292+AP293+AP294+AP290)","v":7898.0941719745233},{"$f":"(-AP296)","v":-3949.0445859872616},0,0,null,0]
[null,null,null,null,null,null,null,null,null,null,null,null,null,null,null,null,null,null,null,null,null,null,"R9",{"$f":"(Z272/10/2)","v":2.5000000000000001E-3},null,0,0,0,0,0,0,{"$f":"(-X296)","v":{"$error":"#DIV/0!"}},{"$f":"(X298+X299+X300+X296)","v":{"$error":"#DIV/0!"}},{"$f":"(-X299)","v":{"$error":"#DIV/0!"}},0,null,0,null,null,null,"R9",{"$f":"(AR272/10/2)","v":2.5000000000000001E-3},null,0,0,0,0,0,0,{"$f":"(-AP296)","v":-3949.0445859872616},{"$f":"(AP298+AP299+AP300+AP296)","v":7898.0941719745233},{"$f":"(-AP299)","v":-3949.0445859872616},0,null,0]
[null,null,null,null,null,null,null,null,null,null,null,null,null,null,null,null,null,null,null,null,null,null,"R10",{"$f":"(Z272/10/2)","v":2.5000000000000001E-3},null,0,0,0,0,0,0,0,{"$f":"(-X299)","v":{"$error":"#DIV/0!"}},{"$f":"(X301+X302+X303+X299)","v":{"$error":"#DIV/0!"}},{"$f":"(-X302)","v":{"$error":"#DIV/0!"}},null,0,null,null,null,"R10",{"$f":"(AR272/10/2)","v":2.5000000000000001E-3},null,0,0,0,0,0,0,0,{"$f":"(-AP299)","v":-3949.0445859872616},{"$f":"(AP301+AP302+AP303+AP299)","v":7898.0941719745233},{"$f":"(-AP302)","v":-3949.0445859872616},null,0]
[null,null,null,null,null,null,null,null,null,null,null,null,null,null,null,null,null,null,null,null,null,null,"R11",{"$f":"(31/(Z274/10))","v":{"$error":"#DIV/0!"}},null,0,0,0,0,0,0,0,0,{"$f":"(-X302)","v":{"$error":"#DIV/0!"}},{"$f":"(X304+X305+X306+X302)","v":{"$error":"#DIV/0!"}},null,0,null,null,null,"R11",{"$f":"(31/(AR274/10))","v":3949.0445859872616},null,0,0,0,0,0,0,0,0,{"$f":"(-AP302)","v":-3949.0445859872616},{"$f":"(AP304+AP305+AP306+AP302)","v":7898.0941719745233},null,0]
[null,null,null,null,null,null,null,null,null,null,null,null,null,null,null,null,null,null,null,null,null,null,"R12",{"$f":"(Z272/10/2)","v":2.5000000000000001E-3},null,null,null,null,null,null,null,null,null,null,null,null,null,null,null,null,"R12",{"$f":"(AR272/10/2)","v":2.5000000000000001E-3}]
[null,null,null,null,null,null,null,null,null,null,null,null,null,null,null,null,null,null,null,null,null,null,"R13",{"$f":"(Z272/10/2)","v":2.5000000000000001E-3},null,null,null,null,null,null,null,null,null,null,null,null,null,null,null,null,"R13",{"$f":"(AR272/10/2)","v":2.5000000000000001E-3}]
[null,null,null,null,null,null,null,null,null,null,null,null,null,null,null,null,null,null,null,null,null,null,"R14",{"$f":"(31/(Z274/10))","v":{"$error":"#DIV/0!"}},null,{"$f":"MINVERSE(Z278:AI287)","v":{"$error":"#DIV/0!"}},null,null,null,null,null,null,null,null,null,null,{"$f":"MMULT(_xlfn.ANCHORARRAY(Z290),AK278:AK287)","v":{"$error":"#DIV/0!"}},null,null,null,"R14",{"$f":"(31/(AR274/10))","v":3949.0445859872616},null,{"$f":"MINVERSE(AR278:BA287)","v":2.5321346340537228E-3},2.2789120336112832E-3,2.0256923185655328E-3,1.7724751683076364E-3,1.5192602622320095E-3,1.2660472797359089E-3,1.0128359002190244E-3,7.5962580308307844E-4,5.0641666773141528E-4,2.5320817356859769E-4,null,{"$f":"MMULT(_xlfn.ANCHORARRAY(AR290),BC278:BC287)","v":0.10128538536214891}]
[null,null,null,null,null,null,null,null,null,null,null,null,null,null,null,null,null,null,null,null,null,null,"R15",{"$f":"(Z272/10/2)","v":2.5000000000000001E-3},null,null,null,null,null,null,null,null,null,null,null,null,null,null,null,null,"R15",{"$f":"(AR272/10/2)","v":2.5000000000000001E-3},null,2.2789120336112836E-3,2.2789149190079712E-3,2.0256948833533876E-3,1.7724774124899061E-3,1.5192621858115352E-3,1.2660488827151259E-3,1.0128371825999626E-3,7.596267648673614E-4,5.0641730892026068E-4,2.5320849416281748E-4,null,9.115648134445134E-2]
[null,null,null,null,null,null,null,null,null,null,null,null,null,null,null,null,null,null,null,null,null,null,"R16",{"$f":"(Z272/10/2)","v":2.5000000000000001E-3},null,null,null,null,null,null,null,null,null,null,null,null,null,null,null,null,"R16",{"$f":"(AR272/10/2)","v":2.5000000000000001E-3},null,2.0256923185655324E-3,2.0256948833533872E-3,2.0257000129323449E-3,1.7724819008572868E-3,1.5192660329730219E-3,1.2660520886755898E-3,1.0128397473634628E-3,7.5962868843714511E-4,5.0641859129876344E-4,2.5320913535166294E-4,null,8.1027692742621296E-2]
[null,null,null,null,null,null,null,null,null,null,null,null,null,null,null,null,null,null,null,null,null,null,"R17",{"$f":"(31/(Z274/10))","v":{"$error":"#DIV/0!"}},null,null,null,null,null,null,null,null,null,null,null,null,null,null,null,null,"R17",{"$f":"(31/(AR274/10))","v":3949.0445859872616},null,1.7724751683076362E-3,1.7724774124899057E-3,1.7724819008572866E-3,1.7724886334154614E-3,1.5192718037213408E-3,1.2660568976213594E-3,1.0128435945127719E-3,7.596315737948649E-4,5.0642051486854715E-4,2.532100971359459E-4,null,7.0899006732305453E-2]
[null,null,null,null,null,null,null,null,null,null,null,null,null,null,null,null,null,null,null,null,null,null,"R18",{"$f":"(Z272/10/2)","v":2.5000000000000001E-3},null,null,null,null,null,null,null,null,null,null,null,null,null,null,null,null,"R18",{"$f":"(AR272/10/2)","v":2.5000000000000001E-3},null,1.5192602622320095E-3,1.5192621858115352E-3,1.5192660329730219E-3,1.5192718037213412E-3,1.5192794980637982E-3,1.2660633095585236E-3,1.0128487240527613E-3,7.596354209441742E-4,5.0642307963204725E-4,2.532113795168841E-4,null,6.0770410489280377E-2]
[null,null,null,null,null,null,null,null,null,null,null,null,null,null,null,null,null,null,null,null,null,null,"R19",{"$f":"(Z272/10/2)","v":2.5000000000000001E-3},null,null,null,null,null,null,null,null,null,null,null,null,null,null,null,null,"R19",{"$f":"(AR272/10/2)","v":2.5000000000000001E-3},null,1.2660472797359082E-3,1.2660488827151257E-3,1.2660520886755896E-3,1.2660568976213594E-3,1.2660633095585233E-3,1.2660713244952008E-3,1.0128551359899255E-3,7.5964022988994379E-4,5.0642628559251104E-4,2.5321298249610124E-4,null,5.0641891189436329E-2]
[null,null,null,null,null,null,null,null,null,null,null,null,null,null,null,null,null,null,null,null,null,null,"R20",{"$f":"(31/(Z274/10))","v":{"$error":"#DIV/0!"}},null,null,null,null,null,null,null,null,null,null,null,null,null,null,null,null,"R20",{"$f":"(31/(AR274/10))","v":3949.0445859872616},null,1.0128359002190242E-3,1.0128371825999626E-3,1.012839747363463E-3,1.0128435945127722E-3,1.0128487240527613E-3,1.0128551359899257E-3,1.0128628303323829E-3,7.5964600063826255E-4,5.0643013275399778E-4,2.5321490607562683E-4,null,4.0513436008760971E-2]
[null,null,null,null,null,null,null,null,null,null,null,null,null,null,null,null,null,null,null,null,null,null,"R21",{"$f":"(Z272/10/2)","v":2.5000000000000001E-3},null,null,null,null,null,null,null,null,null,null,null,null,null,null,null,null,"R21",{"$f":"(AR272/10/2)","v":2.5000000000000001E-3},null,7.5962580308307833E-4,7.596267648673614E-4,7.5962868843714533E-4,7.5963157379486501E-4,7.596354209441742E-4,7.5964022988994379E-4,7.5964600063826255E-4,7.5965273319643682E-4,5.0643462112137823E-4,2.5321715025789637E-4,null,3.0385032123323132E-2]
[null,null,null,null,null,null,null,null,null,null,null,null,null,null,null,null,null,null,null,null,null,null,"R22",{"$f":"(Z272/10/2)","v":2.5000000000000001E-3},null,null,null,null,null,null,null,null,null,null,null,null,null,null,null,null,"R22",{"$f":"(AR272/10/2)","v":2.5000000000000001E-3},null,5.0641666773141539E-4,5.064173089202609E-4,5.0641859129876377E-4,5.0642051486854737E-4,5.0642307963204736E-4,5.0642628559251115E-4,5.0643013275399778E-4,5.0643462112137823E-4,5.0643975070033557E-4,2.5321971504575134E-4,null,2.0256666709256615E-2]
[null,null,null,null,null,null,null,null,null,null,null,null,null,null,null,null,null,null,null,null,null,null,"R23",{"$f":"(31/(Z274/10))","v":{"$error":"#DIV/0!"}},null,null,null,null,null,null,null,null,null,null,null,null,null,null,null,null,"R23",{"$f":"(31/(AR274/10))","v":3949.0445859872616},null,2.532081735685978E-4,2.5320849416281759E-4,2.532091353516631E-4,2.5321009713594607E-4,2.5321137951688421E-4,2.532129824961013E-4,2.5321490607562689E-4,2.5321715025789643E-4,2.532197150457514E-4,2.5322260044243909E-4,null,1.0128326942743912E-2]
[null,null,null,null,null,null,null,null,null,null,null,null,null,null,null,null,null,null,null,null,null,null,"R24",{"$f":"(Z272/10/2)","v":2.5000000000000001E-3},null,null,null,null,null,null,null,null,null,null,null,null,null,null,null,null,"R24",{"$f":"(AR272/10/2)","v":2.5000000000000001E-3}]
[null,null,null,null,null,null,null,null,null,null,null,null,null,null,null,null,null,null,null,null,null,null,"R25",{"$f":"(Z272/10/2)","v":2.5000000000000001E-3},null,null,null,null,null,null,null,null,null,null,null,null,null,"UR30",{"$f":"(X305*AK299)","v":{"$error":"#DIV/0!"}},null,"R25",{"$f":"(AR272/10/2)","v":2.5000000000000001E-3},null,null,null,null,null,null,null,null,null,null,null,null,null,"UR30",{"$f":"(AP305*BC299)","v":39.99721467835176}]
[null,null,null,null,null,null,null,null,null,null,null,null,null,null,null,null,null,null,null,null,null,null,"R26",{"$f":"(31/(Z274/10))","v":{"$error":"#DIV/0!"}},null,null,null,null,null,null,null,null,null,null,null,null,null,null,null,null,"R26",{"$f":"(31/(AR274/10))","v":3949.0445859872616}]
[null,null,null,null,null,null,null,null,null,null,null,null,null,null,null,null,null,null,null,null,null,null,"R27",{"$f":"(Z272/10/2)","v":2.5000000000000001E-3},null,null,null,null,null,null,null,null,null,null,null,null,null,null,null,null,"R27",{"$f":"(AR272/10/2)","v":2.5000000000000001E-3}]
[null,null,null,null,null,null,null,null,null,null,null,null,null,null,null,null,null,null,null,null,null,null,"R28",{"$f":"(Z272/10/2)","v":2.5000000000000001E-3},null,null,null,null,null,null,null,null,null,null,null,null,null,null,null,null,"R28",{"$f":"(AR272/10/2)","v":2.5000000000000001E-3}]
[null,null,null,null,null,null,null,null,null,null,null,null,null,null,null,null,null,null,null,null,null,null,"R29",{"$f":"(31/(Z274/10))","v":{"$error":"#DIV/0!"}},null,null,null,null,null,null,null,null,null,null,null,null,null,null,null,null,"R29",{"$f":"(31/(AR274/10))","v":3949.0445859872616}]
[null,null,null,null,null,null,null,null,null,null,null,null,null,null,null,null,null,null,null,null,null,null,"R30",{"$f":"(Z272/10/2)","v":2.5000000000000001E-3},null,null,null,null,null,null,null,null,null,null,null,null,null,null,null,null,"R30",{"$f":"(AR272/10/2)","v":2.5000000000000001E-3}]
[]
[]
[null,null,null,null,null,null,null,null,null,null,null,null,null,null,null,null,null,null,null,null,null,null,null,"Kaapelin ominaisresistanssi",null,25,"ohm/km",null,null,null,null,null,null,null,null,null,null,null,null,null,null,"Kaapelin ominaisresistanssi",null,25,"ohm/km"]
[null,null,null,null,null,null,null,null,null,null,null,null,null,null,null,null,null,null,null,null,null,null,null,"Kaapelivastus/silmukka",null,{"$f":"((Z309*Z311)/1000)","v":2.5000000000000001E-2},"ohm",null,null,null,null,null,null,null,null,null,null,null,null,null,null,"Kaapelivastus/silmukka",null,{"$f":"((AR309*AR311)/1000)","v":2.5000000000000001E-2},"ohm"]
[null,null,null,null,null,null,null,null,null,null,null,null,null,null,null,null,null,null,null,null,null,null,null,"Kaapelin pituus",null,{"$f":"E148","v":1},"m",null,null,null,null,null,null,null,null,null,null,null,null,null,null,"Kaapelin pituus",null,{"$f":"F148","v":1},"m"]
[null,null,null,null,null,null,null,null,null,null,null,null,null,null,null,null,null,null,null,null,null,null,null,"Kuormitus",null,{"$f":"E150/1000","v":0},"A",null,null,null,null,null,null,null,null,null,null,null,null,null,null,"Kuormitus",null,{"$f":"(F150/1000)","v":7.85E-2},"A"]
[]
[]
[null,null,null,null,null,null,null,null,null,null,null,null,null,null,null,null,null,null,null,null,null,null,"R1",{"$f":"(Z310/10/2)","v":1.25E-3},null,null,null,null,null,null,null,null,null,null,null,null,null,null,null,null,"R1",{"$f":"(AR310/10/2)","v":1.25E-3}]
[null,null,null,null,null,null,null,null,null,null,null,null,null,null,null,null,null,null,null,null,null,null,"R2",{"$f":"(31/(Z312/10))","v":{"$error":"#DIV/0!"}},null,{"$f":"(X315+X316+X317)","v":{"$error":"#DIV/0!"}},{"$f":"(-X316)","v":{"$error":"#DIV/0!"}},0,0,0,0,0,0,0,0,null,40,null,null,null,"R2",{"$f":"(31/(AR312/10))","v":3949.0445859872616},null,{"$f":"(AP315+AP316+AP317)","v":3949.0470859872612},{"$f":"(-AP316)","v":-3949.0445859872616},0,0,0,0,0,0,0,0,null,40]
[null,null,null,null,null,null,null,null,null,null,null,null,null,null,null,null,null,null,null,null,null,null,"R3",{"$f":"(Z310/10/2)","v":1.25E-3},null,{"$f":"(-X316)","v":{"$error":"#DIV/0!"}},{"$f":"(X318+X319+X320+X316)","v":{"$error":"#DIV/0!"}},{"$f":"(-X319)","v":{"$error":"#DIV/0!"}},0,0,0,0,0,0,0,null,0,null,null,null,"R3",{"$f":"(AR310/10/2)","v":1.25E-3},null,{"$f":"(-AP316)","v":-3949.0445859872616},{"$f":"(AP318+AP319+AP320+AP316)","v":7898.0916719745228},{"$f":"(-AP319)","v":-3949.0445859872616},0,0,0,0,0,0,0,null,0]
[null,null,null,null,null,null,null,null,null,null,null,null,null,null,null,null,null,null,null,null,null,null,"R4",{"$f":"(Z310/10/2)","v":1.25E-3},null,0,{"$f":"(-X319)","v":{"$error":"#DIV/0!"}},{"$f":"(X321+X322+X323+X319)","v":{"$error":"#DIV/0!"}},{"$f":"(-X322)","v":{"$error":"#DIV/0!"}},0,0,0,0,0,0,null,0,null,null,null,"R4",{"$f":"(AR310/10/2)","v":1.25E-3},null,0,{"$f":"(-AP319)","v":-3949.0445859872616},{"$f":"(AP321+AP322+AP323+AP319)","v":7898.0916719745228},{"$f":"(-AP322)","v":-3949.0445859872616},0,0,0,0,0,0,null,0]
[null,null,null,null,null,null,null,null,null,null,null,null,null,null,null,null,null,null,null,null,null,null,"R5",{"$f":"(31/(Z312/10))","v":{"$error":"#DIV/0!"}},null,0,0,{"$f":"(-X322)","v":{"$error":"#DIV/0!"}},{"$f":"(X324+X325+X326+X322)","v":{"$error":"#DIV/0!"}},{"$f":"(-X325)","v":{"$error":"#DIV/0!"}},0,0,0,0,0,null,0,null,null,null,"R5",{"$f":"(31/(AR312/10))","v":3949.0445859872616},null,0,0,{"$f":"(-AP322)","v":-3949.0445859872616},{"$f":"(AP324+AP325+AP326+AP322)","v":7898.0916719745228},{"$f":"(-AP325)","v":-3949.0445859872616},0,0,0,0,0,null,0]
[null,null,null,null,null,null,null,null,null,null,null,null,null,null,null,null,null,null,null,null,null,null,"R6",{"$f":"(Z310/10/2)","v":1.25E-3},null,0,0,0,{"$f":"(-X325)","v":{"$error":"#DIV/0!"}},{"$f":"(X327+X328+X329+X325)","v":{"$error":"#DIV/0!"}},{"$f":"(-X328)","v":{"$error":"#DIV/0!"}},0,0,0,0,null,0,null,null,null,"R6",{"$f":"(AR310/10/2)","v":1.25E-3},null,0,0,0,{"$f":"(-AP325)","v":-3949.0445859872616},{"$f":"(AP327+AP328+AP329+AP325)","v":7898.0916719745228},{"$f":"(-AP328)","v":-3949.0445859872616},0,0,0,0,null,0]
[null,null,null,null,null,null,null,null,null,null,null,null,null,null,null,null,null,null,null,null,null,null,"R7",{"$f":"(Z310/10/2)","v":1.25E-3},null,0,0,0,0,{"$f":"(-X328)","v":{"$error":"#DIV/0!"}},{"$f":"(X330+X331+X332+X328)","v":{"$error":"#DIV/0!"}},{"$f":"(-X331)","v":{"$error":"#DIV/0!"}},0,0,0,null,0,null,null,null,"R7",{"$f":"(AR310/10/2)","v":1.25E-3},null,0,0,0,0,{"$f":"(-AP328)","v":-3949.0445859872616},{"$f":"(AP330+AP331+AP332+AP328)","v":7898.0916719745228},{"$f":"(-AP331)","v":-3949.0445859872616},0,0,0,null,0]
[null,null,null,null,null,null,null,null,null,null,null,null,null,null,null,null,null,null,null,null,null,null,"R8",{"$f":"(31/(Z312/10))","v":{"$error":"#DIV/0!"}},null,0,0,0,0,0,{"$f":"(-X331)","v":{"$error":"#DIV/0!"}},{"$f":"(X330+X331+X332+X328)","v":{"$error":"#DIV/0!"}},{"$f":"(-X334)","v":{"$error":"#DIV/0!"}},0,0,null,0,null,null,null,"R8",{"$f":"(31/(AR312/10))","v":3949.0445859872616},null,0,0,0,0,0,{"$f":"(-AP331)","v":-3949.0445859872616},{"$f":"(AP330+AP331+AP332+AP328)","v":7898.0916719745228},{"$f":"(-AP334)","v":-3949.0445859872616},0,0,null,0]
[null,null,null,null,null,null,null,null,null,null,null,null,null,null,null,null,null,null,null,null,null,null,"R9",{"$f":"(Z310/10/2)","v":1.25E-3},null,0,0,0,0,0,0,{"$f":"(-X334)","v":{"$error":"#DIV/0!"}},{"$f":"(X336+X337+X338+X334)","v":{"$error":"#DIV/0!"}},{"$f":"(-X337)","v":{"$error":"#DIV/0!"}},0,null,0,null,null,null,"R9",{"$f":"(AR310/10/2)","v":1.25E-3},null,0,0,0,0,0,0,{"$f":"(-AP334)","v":-3949.0445859872616},{"$f":"(AP336+AP337+AP338+AP334)","v":7898.0916719745228},{"$f":"(-AP337)","v":-3949.0445859872616},0,null,0]
[null,null,null,null,null,null,null,null,null,null,null,null,null,null,null,null,null,null,null,null,null,null,"R10",{"$f":"(Z310/10/2)","v":1.25E-3},null,0,0,0,0,0,0,0,{"$f":"(-X337)","v":{"$error":"#DIV/0!"}},{"$f":"(X339+X340+X341+X337)","v":{"$error":"#DIV/0!"}},{"$f":"(-X340)","v":{"$error":"#DIV/0!"}},null,0,null,null,null,"R10",{"$f":"(AR310/10/2)","v":1.25E-3},null,0,0,0,0,0,0,0,{"$f":"(-AP337)","v":-3949.0445859872616},{"$f":"(AP339+AP340+AP341+AP337)","v":7898.0916719745228},{"$f":"(-AP340)","v":-3949.0445859872616},null,0]
[null,null,null,null,null,null,null,null,null,null,null,null,null,null,null,null,null,null,null,null,null,null,"R11",{"$f":"(31/(Z312/10))","v":{"$error":"#DIV/0!"}},null,0,0,0,0,0,0,0,0,{"$f":"(-X340)","v":{"$error":"#DIV/0!"}},{"$f":"(X342+X343+X344+X340)","v":{"$error":"#DIV/0!"}},null,0,null,null,null,"R11",{"$f":"(31/(AR312/10))","v":3949.0445859872616},null,0,0,0,0,0,0,0,0,{"$f":"(-AP340)","v":-3949.0445859872616},{"$f":"(AP342+AP343+AP344+AP340)","v":7898.0916719745228},null,0]
[null,null,null,null,null,null,null,null,null,null,null,null,null,null,null,null,null,null,null,null,null,null,"R12",{"$f":"(Z310/10/2)","v":1.25E-3},null,null,null,null,null,null,null,null,null,null,null,null,null,null,null,null,"R12",{"$f":"(AR310/10/2)","v":1.25E-3}]
[null,null,null,null,null,null,null,null,null,null,null,null,null,null,null,null,null,null,null,null,null,null,"R13",{"$f":"(Z310/10/2)","v":1.25E-3},null,null,null,null,null,null,null,null,null,null,null,null,null,null,null,null,"R13",{"$f":"(AR310/10/2)","v":1.25E-3}]
[null,null,null,null,null,null,null,null,null,null,null,null,null,null,null,null,null,null,null,null,null,null,"R14",{"$f":"(31/(Z312/10))","v":{"$error":"#DIV/0!"}},null,{"$f":"MINVERSE(Z316:AI325)","v":{"$error":"#DIV/0!"}},null,null,null,null,null,null,null,null,null,null,{"$f":"MMULT(_xlfn.ANCHORARRAY(Z328),AK316:AK325)","v":{"$error":"#DIV/0!"}},null,null,null,"R14",{"$f":"(31/(AR312/10))","v":3949.0445859872616},null,{"$f":"MINVERSE(AR316:BA325)","v":2.5321963475581043E-3},2.2789721441501469E-3,2.0257493834785864E-3,1.7725279052370796E-3,1.5193075491200931E-3,1.2660881548228046E-3,1.0128695620410014E-3,7.5965161047097701E-4,5.0643413980943209E-4,2.5321698975337047E-4,null,{"$f":"MMULT(_xlfn.ANCHORARRAY(AR328),BC316:BC325)","v":0.10128785390232417}]
[null,null,null,null,null,null,null,null,null,null,null,null,null,null,null,null,null,null,null,null,null,null,"R15",{"$f":"(Z310/10/2)","v":1.25E-3},null,null,null,null,null,null,null,null,null,null,null,null,null,null,null,null,"R15",{"$f":"(AR310/10/2)","v":1.25E-3},null,2.2789721441501469E-3,2.2789735868865447E-3,2.0257506659086396E-3,1.7725290273616001E-3,1.5193085109397914E-3,1.2660889563382897E-3,1.0128702032527806E-3,7.5965209137945607E-4,5.0643446041491577E-4,2.5321715005606151E-4,null,9.1158885766005879E-2]
[null,null,null,null,null,null,null,null,null,null,null,null,null,null,null,null,null,null,null,null,null,null,"R16",{"$f":"(Z310/10/2)","v":1.25E-3},null,null,null,null,null,null,null,null,null,null,null,null,null,null,null,null,"R16",{"$f":"(AR310/10/2)","v":1.25E-3},null,2.0257493834785869E-3,2.0257506659086401E-3,2.0257532307695579E-3,1.7725312716113514E-3,1.5193104345797969E-3,1.2660905593697672E-3,1.0128714856767447E-3,7.5965305319671873E-4,5.0643510162608598E-4,2.5321747066154514E-4,null,8.1029975339143467E-2]
[null,null,null,null,null,null,null,null,null,null,null,null,null,null,null,null,null,null,null,null,null,null,"R17",{"$f":"(31/(Z312/10))","v":{"$error":"#DIV/0!"}},null,null,null,null,null,null,null,null,null,null,null,null,null,null,null,null,"R17",{"$f":"(31/(AR312/10))","v":3949.0445859872616},null,1.77252790523708E-3,1.7725290273616003E-3,1.772531271611352E-3,1.7725346379877545E-3,1.5193133200413272E-3,1.2660929639182518E-3,1.0128734093137058E-3,7.59654495923374E-4,5.0643606344334875E-4,2.532179515700243E-4,null,7.0901116209483195E-2]
[null,null,null,null,null,null,null,null,null,null,null,null,null,null,null,null,null,null,null,null,null,null,"R18",{"$f":"(Z310/10/2)","v":1.25E-3},null,null,null,null,null,null,null,null,null,null,null,null,null,null,null,null,"R18",{"$f":"(AR310/10/2)","v":1.25E-3},null,1.5193075491200935E-3,1.5193085109397916E-3,1.5193104345797973E-3,1.5193133200413274E-3,1.5193171673262094E-3,1.2660961699852659E-3,1.0128759741648815E-3,7.5965641956033509E-4,5.0643734586731286E-4,2.5321859278180339E-4,null,6.0772301964803738E-2]
[null,null,null,null,null,null,null,null,null,null,null,null,null,null,null,null,null,null,null,null,null,null,"R19",{"$f":"(Z310/10/2)","v":1.25E-3},null,null,null,null,null,null,null,null,null,null,null,null,null,null,null,null,"R19",{"$f":"(AR310/10/2)","v":1.25E-3},null,1.266088154822805E-3,1.2660889563382899E-3,1.2660905593697676E-3,1.2660929639182518E-3,1.2660961699852659E-3,1.2661001775728388E-3,1.0128791802318953E-3,7.5965882410881968E-4,5.0643894889879017E-4,2.532193942972884E-4,null,5.0643526192912201E-2]
[null,null,null,null,null,null,null,null,null,null,null,null,null,null,null,null,null,null,null,null,null,null,"R20",{"$f":"(31/(Z312/10))","v":{"$error":"#DIV/0!"}},null,null,null,null,null,null,null,null,null,null,null,null,null,null,null,null,"R20",{"$f":"(31/(AR312/10))","v":3949.0445859872616},null,1.0128695620410014E-3,1.0128702032527804E-3,1.012871485676745E-3,1.0128734093137056E-3,1.0128759741648812E-3,1.0128791802318953E-3,1.0128830275167773E-3,7.5966170957035008E-4,5.0644087253879559E-4,2.5322035611698667E-4,null,4.051478248164006E-2]
[null,null,null,null,null,null,null,null,null,null,null,null,null,null,null,null,null,null,null,null,null,null,"R21",{"$f":"(Z310/10/2)","v":1.25E-3},null,null,null,null,null,null,null,null,null,null,null,null,null,null,null,null,"R21",{"$f":"(AR310/10/2)","v":1.25E-3},null,7.5965161047097712E-4,7.5965209137945618E-4,7.5965305319671906E-4,7.5965449592337421E-4,7.596564195603352E-4,7.5965882410881978E-4,7.5966170957035008E-4,7.5966507594675298E-4,5.0644311678854691E-4,2.5322147824150714E-4,null,3.0386064418839086E-2]
[null,null,null,null,null,null,null,null,null,null,null,null,null,null,null,null,null,null,null,null,null,null,"R22",{"$f":"(Z310/10/2)","v":1.25E-3},null,null,null,null,null,null,null,null,null,null,null,null,null,null,null,null,"R22",{"$f":"(AR310/10/2)","v":1.25E-3},null,5.0643413980943199E-4,5.0643446041491555E-4,5.0643510162608587E-4,5.0643606344334853E-4,5.0643734586731264E-4,5.0643894889879006E-4,5.0644087253879548E-4,5.064431167885468E-4,5.0644568164946485E-4,2.5322276067156019E-4,null,2.0257365592377279E-2]
[null,null,null,null,null,null,null,null,null,null,null,null,null,null,null,null,null,null,null,null,null,null,"R23",{"$f":"(31/(Z312/10))","v":{"$error":"#DIV/0!"}},null,null,null,null,null,null,null,null,null,null,null,null,null,null,null,null,"R23",{"$f":"(31/(AR312/10))","v":3949.0445859872616},null,2.5321698975337047E-4,2.5321715005606151E-4,2.5321747066154519E-4,2.532179515700243E-4,2.5321859278180339E-4,2.532193942972884E-4,2.5322035611698661E-4,2.5322147824150714E-4,2.5322276067156019E-4,2.5322420340795766E-4,null,1.0128679590134819E-2]
[null,null,null,null,null,null,null,null,null,null,null,null,null,null,null,null,null,null,null,null,null,null,"R24",{"$f":"(Z310/10/2)","v":1.25E-3},null,null,null,null,null,null,null,null,null,null,null,null,null,null,null,null,"R24",{"$f":"(AR310/10/2)","v":1.25E-3}]
[null,null,null,null,null,null,null,null,null,null,null,null,null,null,null,null,null,null,null,null,null,null,"R25",{"$f":"(Z310/10/2)","v":1.25E-3},null,null,null,null,null,null,null,null,null,null,null,null,null,"UR30",{"$f":"(X343*AK337)","v":{"$error":"#DIV/0!"}},null,"R25",{"$f":"(AR310/10/2)","v":1.25E-3},null,null,null,null,null,null,null,null,null,null,null,null,null,"UR30",{"$f":"(AP343*BC337)","v":39.998607298621586}]
[null,null,null,null,null,null,null,null,null,null,null,null,null,null,null,null,null,null,null,null,null,null,"R26",{"$f":"(31/(Z312/10))","v":{"$error":"#DIV/0!"}},null,null,null,null,null,null,null,null,null,null,null,null,null,null,null,null,"R26",{"$f":"(31/(AR312/10))","v":3949.0445859872616}]
[null,null,null,null,null,null,null,null,null,null,null,null,null,null,null,null,null,null,null,null,null,null,"R27",{"$f":"(Z310/10/2)","v":1.25E-3},null,null,null,null,null,null,null,null,null,null,null,null,null,null,null,null,"R27",{"$f":"(AR310/10/2)","v":1.25E-3}]
[null,null,null,null,null,null,null,null,null,null,null,null,null,null,null,null,null,null,null,null,null,null,"R28",{"$f":"(Z310/10/2)","v":1.25E-3},null,null,null,null,null,null,null,null,null,null,null,null,null,null,null,null,"R28",{"$f":"(AR310/10/2)","v":1.25E-3}]
[null,null,null,null,null,null,null,null,null,null,null,null,null,null,null,null,null,null,null,null,null,null,"R29",{"$f":"(31/(Z312/10))","v":{"$error":"#DIV/0!"}},null,null,null,null,null,null,null,null,null,null,null,null,null,null,null,null,"R29",{"$f":"(31/(AR312/10))","v":3949.0445859872616}]
[null,null,null,null,null,null,null,null,null,null,null,null,null,null,null,null,null,null,null,null,null,null,"R30",{"$f":"(Z310/10/2)","v":1.25E-3},null,null,null,null,null,null,null,null,null,null,null,null,null,null,null,null,"R30",{"$f":"(AR310/10/2)","v":1.25E-3}]